{"text_format":"1","workbook":"xlsx","n_sheets":5,"sheets":["Stage 1","Stage 2_Fed","Stage 2_NonFed","Stage 3","List"],"not_rendered":{"charts":0,"images":1,"macros":1,"external_links":0,"defined_names":32,"comments":3,"pivot_tables":0},"unopened":[],"bounds":{"document_bytes":16777216,"sheet_cells":100000,"rows_first":2000,"rows_last":500,"rows_between":2000,"halvings":0,"cell_chars":16384,"cell_head_chars":4096},"cells_cut":0,"cells_raw":0,"read":"whole","date_system":"1900"}

{"sheet":"Stage 1","index":0,"n_rows":91,"n_cols":16,"rows_kept":91,"cut":false,"hidden":false,"merged":[[90,7,90,8],[87,0,87,2],[2,0,2,11],[4,0,4,1],[5,0,5,1],[20,8,20,9],[21,1,21,3],[13,0,13,16],[14,0,14,1],[14,2,14,3],[14,4,14,5],[15,0,15,2],[3,0,3,16],[7,0,7,4],[9,0,9,4],[21,4,21,7],[26,15,27,16],[23,1,23,3],[23,4,23,7],[23,8,23,9],[23,11,23,12],[19,0,25,0],[19,1,19,3],[19,4,19,7],[24,8,24,9],[24,11,24,12],[24,13,24,14],[23,13,23,14],[24,1,24,3],[24,4,24,7],[19,15,20,16],[20,1,20,3],[20,4,20,7],[19,8,19,10],[19,11,20,14],[21,8,21,9],[21,11,21,14],[21,15,21,16],[22,1,22,3],[22,4,22,7],[22,8,22,9],[22,11,22,12],[22,13,22,14],[28,11,28,14],[25,11,25,14],[27,1,27,3],[27,4,27,7],[27,8,27,9],[28,15,28,16],[29,1,29,3],[29,4,29,7],[29,8,29,9],[29,11,29,12],[29,13,29,14],[25,15,25,16],[25,1,25,3],[25,4,25,7],[25,8,25,9],[37,0,37,5],[37,6,37,10],[37,11,37,15],[38,0,38,5],[38,6,38,10],[35,8,35,9],[35,10,35,11],[35,12,35,15],[36,0,36,1],[36,2,36,7],[36,8,36,9],[48,11,48,14],[43,4,43,7],[43,8,43,9],[43,11,43,12],[43,13,43,14],[39,0,45,0],[39,1,39,3],[39,4,39,7],[39,8,39,10],[39,11,40,14],[41,4,41,7],[41,8,41,9],[41,11,41,14],[46,15,47,16],[39,15,40,16],[40,1,40,3],[40,4,40,7],[40,8,40,9],[45,15,45,16],[44,1,44,3],[44,4,44,7],[44,8,44,9],[44,11,44,12],[44,13,44,14],[45,1,45,3],[45,4,45,7],[45,8,45,9],[41,1,41,3],[46,1,46,3],[46,4,46,7],[46,8,46,10],[46,11,47,14],[42,13,42,14],[43,1,43,3],[41,15,41,16],[59,11,59,14],[59,15,59,16],[53,0,59,0],[53,15,54,16],[50,1,50,3],[50,4,50,7],[50,8,50,9],[50,11,50,12],[50,13,50,14],[51,1,51,3],[51,4,51,7],[51,8,51,9],[51,11,51,12],[51,13,51,14],[54,8,54,9],[52,11,52,14],[52,15,52,16],[46,0,52,0],[59,1,59,3],[59,4,59,7],[59,8,59,9],[57,1,57,3],[57,4,57,7],[57,8,57,9],[75,11,75,16],[68,2,68,7],[68,8,70,8],[68,0,70,1],[71,0,71,1],[72,0,72,1],[73,0,73,1],[74,0,74,1],[68,11,70,16],[71,11,71,16],[71,2,71,3],[71,6,71,7],[70,4,70,5],[69,6,70,7],[69,2,69,5],[90,0,90,1],[90,2,90,6],[90,9,90,14],[78,0,78,1],[77,6,77,7],[77,11,77,16],[77,0,77,1],[76,0,76,1],[76,2,76,3],[76,4,76,5],[76,6,76,7],[83,9,83,10],[83,0,83,1],[80,0,80,1],[85,0,85,16],[86,0,86,16],[87,3,87,16],[88,0,88,1],[88,2,88,16],[89,2,89,6],[89,9,89,14],[89,0,89,1],[81,0,81,1],[82,0,82,1],[89,7,89,8],[14,14,14,15],[14,6,14,13],[16,0,16,1],[15,12,15,15],[15,10,15,11],[15,8,15,9],[15,3,15,7],[34,13,34,15],[17,11,17,15],[18,11,18,15],[18,6,18,10],[17,6,17,10],[16,8,16,9],[53,11,54,14],[62,0,62,16],[63,0,63,16],[64,0,64,16],[66,0,66,16],[67,0,67,16],[75,0,75,1],[75,2,75,3],[75,4,75,5],[75,6,75,7],[6,10,6,11],[7,12,7,16],[7,10,7,11],[7,5,7,9],[10,5,10,16],[11,5,11,16],[9,5,9,16],[16,10,16,16],[16,2,16,7],[10,0,10,4],[6,14,6,16],[6,8,6,9],[8,0,8,4],[8,12,8,16],[6,0,6,1],[8,5,8,7],[8,8,8,11],[6,12,6,13],[18,0,18,5],[17,0,17,5],[32,1,32,3],[32,4,32,7],[32,8,32,9],[48,15,48,16],[49,1,49,3],[49,4,49,7],[49,8,49,9],[49,11,49,12],[49,13,49,14],[47,1,47,3],[47,4,47,7],[47,8,47,9],[48,1,48,3],[48,4,48,7],[48,8,48,9],[34,4,34,5],[34,6,34,12],[38,11,38,15],[42,1,42,3],[42,4,42,7],[42,8,42,9],[42,11,42,12],[54,1,54,3],[54,4,54,7],[55,1,55,3],[55,4,55,7],[55,8,55,9],[52,1,52,3],[52,4,52,7],[52,8,52,9],[53,1,53,3],[53,4,53,7],[53,8,53,10],[57,11,57,12],[57,13,57,14],[58,11,58,12],[58,13,58,14],[55,11,55,14],[55,15,55,16],[56,1,56,3],[56,4,56,7],[56,8,56,9],[56,11,56,12],[56,13,56,14],[58,1,58,3],[58,4,58,7],[58,8,58,9],[79,0,79,1],[81,9,81,10],[81,2,81,3],[81,4,81,5],[81,6,81,7],[80,9,80,10],[71,9,71,10],[68,9,70,10],[70,2,70,3],[77,2,77,3],[77,4,77,5],[80,2,80,3],[78,9,78,10],[79,9,79,10],[76,9,76,10],[77,9,77,10],[72,9,72,10],[72,2,72,3],[72,4,72,5],[72,6,72,7],[74,9,74,10],[75,9,75,10],[73,9,73,10],[71,4,71,5],[83,2,83,3],[83,4,83,5],[83,6,83,7],[83,11,83,16],[78,11,78,16],[79,2,79,3],[79,4,79,5],[79,6,79,7],[79,11,79,16],[80,4,80,5],[80,6,80,7],[80,11,80,16],[82,9,82,10],[78,2,78,7],[81,11,81,16],[82,2,82,3],[82,4,82,5],[82,6,82,7],[82,11,82,16],[36,10,36,16],[32,11,32,14],[32,15,32,16],[34,0,34,1],[34,2,34,3],[26,0,32,0],[26,1,26,3],[26,4,26,7],[26,8,26,10],[26,11,27,14],[28,1,28,3],[28,4,28,7],[28,8,28,9],[33,0,33,16],[30,1,30,3],[30,4,30,7],[30,8,30,9],[30,11,30,12],[30,13,30,14],[31,1,31,3],[31,4,31,7],[31,8,31,9],[31,11,31,12],[31,13,31,14],[76,11,76,16],[5,8,5,9],[5,2,5,7],[4,10,4,12],[4,13,4,16],[4,2,4,9],[6,2,6,7],[0,11,0,16],[0,0,0,10],[1,0,1,11],[72,11,72,16],[73,2,73,3],[73,4,73,5],[73,6,73,7],[73,11,73,16],[74,2,74,3],[74,4,74,5],[74,6,74,7],[74,11,74,16],[5,10,5,14],[11,0,11,4],[45,11,45,14],[35,0,35,2],[35,3,35,7]]}
["Florida Department of Transportation",null,null,null,null,null,null,null,null,null,null,"Intersection Control Evaluation Form 750-010-003"]
["Intersection Control Evaluation (ICE) Form"]
["Stage 1: Screening"]
["To fulfill the requirements of Stage 1 (Screening) of FDOT's ICE procedures, complete the following form and append all supporting  documentation. Completed forms can be submitted to the District Traffic Operations Engineer (DTOE) and District Design Engineer (DDE) for the project's approval."]
["Project Name",null,null,null,null,null,null,null,null,null,"FDOT Project #"]
["Submitted By",null,null,null,null,null,null,null,"Agency/Company",null,null,null,null,null,null,"Date"]
{"$rows_left_out":86}
{"sheet":"Stage 2_Fed","index":1,"n_rows":117,"n_cols":23,"rows_kept":117,"cut":false,"hidden":true,"merged":[[38,5,38,7],[38,17,38,20],[38,14,38,16],[38,11,38,13],[38,8,38,10],[39,14,39,16],[40,14,40,16],[41,14,41,16],[39,17,39,20],[40,17,40,20],[41,17,41,20],[39,11,39,13],[41,11,41,13],[40,11,40,13],[39,8,39,10],[39,5,39,7],[40,5,40,7],[41,5,41,7],[40,8,40,10],[41,8,41,10],[45,8,45,10],[46,17,46,20],[47,17,47,20],[46,14,46,16],[47,14,47,16],[42,5,42,7],[42,8,42,10],[43,5,43,7],[43,8,43,10],[44,5,44,7],[44,8,44,10],[46,8,46,10],[47,8,47,10],[43,14,43,16],[44,14,44,16],[42,11,42,13],[42,17,42,20],[43,11,43,13],[43,17,43,20],[45,11,45,13],[45,14,45,16],[45,17,45,20],[63,4,64,7],[63,0,64,3],[65,0,65,3],[66,0,66,3],[67,0,67,3],[68,0,68,3],[69,0,69,3],[70,0,70,3],[65,4,65,7],[66,4,66,7],[67,4,67,7],[68,4,68,7],[69,4,69,7],[70,4,70,7],[69,15,69,16],[69,17,69,19],[69,20,69,23],[70,12,70,14],[70,15,70,16],[70,17,70,19],[70,20,70,23],[63,8,64,11],[65,8,65,11],[66,8,66,11],[67,8,67,11],[68,8,68,11],[69,8,69,11],[70,8,70,11],[63,12,63,23],[67,20,67,23],[68,12,68,14],[68,15,68,16],[68,17,68,19],[68,20,68,23],[69,12,69,14],[79,10,79,16],[79,17,79,23],[79,4,79,9],[79,0,79,3],[75,15,75,16],[76,15,76,16],[77,15,77,16],[74,15,74,18],[64,20,64,23],[64,17,64,19],[64,15,64,16],[64,12,64,14],[65,12,65,14],[65,15,65,16],[65,17,65,19],[65,20,65,23],[66,12,66,14],[66,15,66,16],[66,17,66,19],[66,20,66,23],[67,12,67,14],[67,15,67,16],[67,17,67,19],[77,17,77,18],[115,22,115,23],[115,7,115,9],[115,10,115,20],[116,7,116,9],[116,10,116,20],[116,22,116,23],[53,15,53,16],[52,15,52,18],[54,15,54,16],[55,15,55,16],[56,15,56,16],[57,15,57,16],[58,15,58,16],[59,15,59,16],[80,10,80,16],[80,17,80,23],[81,4,81,9],[81,10,81,16],[81,17,81,23],[82,4,82,9],[82,10,82,16],[82,17,82,23],[107,4,107,6],[108,4,108,6],[109,4,109,6],[105,0,105,3],[106,0,106,3],[107,0,107,3],[108,0,108,3],[109,0,109,3],[104,7,104,23],[105,7,105,23],[106,7,106,23],[107,7,107,23],[108,7,108,23],[109,7,109,23],[104,0,104,3],[103,0,103,3],[103,4,103,6],[103,7,103,23],[104,4,104,6],[105,4,105,6],[106,4,106,6],[80,0,80,3],[81,0,81,3],[82,0,82,3],[83,0,83,3],[84,0,84,3],[85,0,85,3],[80,4,80,9],[89,0,89,3],[89,4,89,23],[83,4,83,9],[83,10,83,16],[83,17,83,23],[84,4,84,9],[84,10,84,16],[84,17,84,23],[85,4,85,9],[85,10,85,16],[85,17,85,23],[75,17,75,18],[75,13,75,14],[75,11,75,12],[74,11,74,14],[74,7,74,10],[75,9,75,10],[75,7,75,8],[77,0,77,6],[76,7,76,8],[77,7,77,8],[77,9,77,10],[76,9,76,10],[76,11,76,12],[77,11,77,12],[76,13,76,14],[77,13,77,14],[21,14,21,16],[26,14,26,16],[23,13,23,16],[24,12,24,13],[25,12,25,13],[26,12,26,13],[59,19,59,21],[52,19,52,23],[52,4,53,14],[54,4,54,14],[55,4,55,14],[56,4,56,14],[57,4,57,14],[58,4,58,14],[59,4,59,14],[59,22,59,23],[54,19,54,21],[55,19,55,21],[56,19,56,21],[57,19,57,21],[58,19,58,21],[57,17,57,18],[58,17,58,18],[45,5,45,7],[7,0,7,5],[8,0,8,5],[22,0,22,1],[22,2,22,3],[12,11,12,13],[12,2,12,10],[15,14,15,16],[12,14,12,23],[7,15,7,23],[17,8,17,10],[20,18,20,20],[21,18,21,20],[16,21,16,23],[17,21,17,23],[19,21,19,23],[20,21,20,23],[21,21,21,23],[17,6,17,7],[17,0,17,4],[16,14,16,16],[17,14,17,16],[18,14,18,16],[19,14,19,16],[20,14,20,16],[91,0,91,3],[92,0,92,3],[90,4,90,23],[27,12,27,13],[28,12,28,13],[29,12,29,13],[30,12,30,13],[16,12,16,13],[17,12,17,13],[18,12,18,13],[19,12,19,13],[20,12,20,13],[21,12,21,13],[22,4,22,23],[23,0,24,4],[23,5,23,6],[23,7,23,10],[26,0,26,4],[27,0,27,4],[25,0,25,4],[25,6,25,7],[25,8,25,10],[25,18,25,20],[25,21,25,23],[75,19,75,21],[74,19,74,23],[76,19,77,21],[50,0,50,2],[111,0,111,23],[115,2,115,6],[114,0,114,1],[114,2,114,23],[113,3,113,23],[112,0,112,23],[115,0,115,1],[113,0,113,2],[101,0,101,23],[102,0,102,23],[97,0,97,23],[98,0,98,23],[99,0,99,23],[93,0,93,3],[94,0,94,3],[93,4,93,23],[94,4,94,23],[88,0,88,23],[87,0,87,23],[90,0,90,3],[36,0,36,23],[54,0,54,3],[55,0,55,3],[56,0,56,3],[57,0,57,3],[58,0,58,3],[59,0,59,3],[52,0,53,3],[51,0,51,23],[59,17,59,18],[54,17,54,18],[55,17,55,18],[56,17,56,18],[54,22,54,23],[55,22,55,23],[56,22,56,23],[57,22,57,23],[58,22,58,23],[37,12,37,20],[53,22,53,23],[53,19,53,21],[53,17,53,18],[46,11,46,13],[42,14,42,16],[14,11,14,12],[31,0,34,2],[28,0,28,4],[29,0,29,4],[31,3,34,23],[29,6,29,7],[29,8,29,10],[29,18,29,20],[29,21,29,23],[30,6,30,7],[30,8,30,10],[30,18,30,20],[30,21,30,23],[30,0,30,4],[28,14,28,16],[29,14,29,16],[30,14,30,16],[14,17,14,18],[14,19,14,23],[14,13,14,16],[23,17,23,18],[23,19,23,23],[24,14,24,16],[25,14,25,16],[21,8,21,10],[4,12,4,17],[8,15,8,23],[27,6,27,7],[27,8,27,10],[27,18,27,20],[27,21,27,23],[28,6,28,7],[28,8,28,10],[28,18,28,20],[28,21,28,23],[26,21,26,23],[26,6,26,7],[26,8,26,10],[26,18,26,20],[27,14,27,16],[5,7,5,10],[5,11,5,16],[5,18,5,23],[5,2,5,6],[7,6,7,14],[8,6,8,14],[23,11,23,12],[15,12,15,13],[15,21,15,23],[19,0,19,4],[20,0,20,4],[21,0,21,4],[24,6,24,7],[24,18,24,20],[24,21,24,23],[15,18,15,20],[16,18,16,20],[17,18,17,20],[18,18,18,20],[19,18,19,20],[18,6,18,7],[19,6,19,7],[20,6,20,7],[21,6,21,7],[18,0,18,4],[24,8,24,10],[16,8,16,10],[16,0,16,4],[18,21,18,23],[18,8,18,10],[19,8,19,10],[20,8,20,10],[0,0,0,10],[1,0,1,17],[2,0,2,17],[3,0,3,23],[11,0,11,23],[15,8,15,10],[15,6,15,7],[16,6,16,7],[14,5,14,6],[14,7,14,10],[10,0,10,23],[13,0,13,1],[13,2,13,3],[14,0,15,4],[13,4,13,23],[0,14,0,23],[4,0,4,1],[5,0,5,1],[6,0,6,23],[12,0,12,1],[4,18,4,20],[4,21,4,23],[4,2,4,8],[4,9,4,11],[44,3,44,4],[45,3,45,4],[46,3,46,4],[47,3,47,4],[48,3,48,4],[49,3,49,4],[50,3,50,4],[38,0,38,4],[116,0,116,1],[116,2,116,6],[46,5,46,7],[47,5,47,7],[72,0,72,23],[76,0,76,6],[76,17,76,18],[74,0,74,6],[62,0,62,23],[61,0,61,23],[91,4,91,23],[92,4,92,23],[78,0,78,23],[73,0,73,23],[75,22,75,23],[76,22,77,23],[37,21,37,23],[39,0,41,2],[42,0,44,2],[45,0,47,2],[48,0,48,2],[49,0,49,2],[39,3,39,4],[40,3,40,4],[41,3,41,4],[42,3,42,4],[43,3,43,4],[38,21,38,23],[39,21,39,23],[40,21,40,23],[41,21,41,23],[42,21,42,23],[43,21,43,23],[44,21,44,23],[45,21,45,23],[44,11,44,13],[44,17,44,20],[46,21,46,23],[47,21,47,23],[47,11,47,13],[50,21,50,23],[48,21,48,23],[49,21,49,23],[48,11,48,13],[49,11,49,13],[48,8,48,10],[49,8,49,10],[48,5,48,7],[49,5,49,7],[50,5,50,7],[50,8,50,10],[50,11,50,13],[50,14,50,16],[50,17,50,20],[48,14,48,16],[49,14,49,16],[48,17,48,20],[49,17,49,20]]}
["Florida Department of Transportation",null,null,null,null,null,null,null,null,null,null,null,null,null,"Intersection Control Evaluation Form 750-010-003"]
["Intersection Control Evaluation (ICE) Form"]
["Stage 2: Initial Control Strategy Assessment"]
["To fulfill the requirements of Stage 2 (Intersection Control Strategy) of FDOT's ICE procedures, complete the following form and append all supporting  documentation. Completed forms can be submitted to the District Traffic Operations Engineer (DTOE) and District Design Engineer (DDE) for the project's approval."]
["Project Name",null,{"$f":"IF('Stage 1'!C5=\"\",\"\",'Stage 1'!C5)","v":""},null,null,null,null,null,null,"FDOT Project #",null,null,{"$f":"IF('Stage 1'!N5=\"\",\"\",'Stage 1'!N5)","v":""},null,null,null,null,null,"Date"]
["Submitted By",null,{"$f":"IF('Stage 1'!C6=\"\",\"\",'Stage 1'!C6)","v":""},null,null,null,null,"Agency/Company",null,null,null,{"$f":"IF('Stage 1'!K6=\"\",\"\",'Stage 1'!K6)","v":""},null,null,null,null,null,"Email",{"$f":"IF('Stage 1'!C7=\"\",\"\",'Stage 1'!C7)","v":""}]
{"$rows_left_out":112}
{"sheet":"Stage 2_NonFed","index":2,"n_rows":97,"n_cols":23,"rows_kept":97,"cut":false,"hidden":true,"merged":[[0,0,0,10],[0,14,0,23],[1,0,1,17],[2,0,2,17],[3,0,3,23],[4,0,4,1],[4,2,4,8],[4,9,4,11],[4,12,4,17],[4,18,4,20],[6,0,6,23],[7,0,7,5],[7,6,7,14],[7,15,7,23],[8,0,8,5],[8,6,8,14],[8,15,8,23],[4,21,4,23],[5,0,5,1],[5,2,5,6],[5,7,5,10],[5,11,5,16],[5,18,5,23],[13,0,13,1],[13,2,13,3],[13,4,13,23],[14,0,15,4],[10,0,10,23],[11,0,11,23],[12,0,12,1],[12,2,12,10],[12,11,12,13],[12,14,12,23],[14,15,21,23],[14,5,14,8],[14,9,14,14],[15,6,15,8],[15,9,15,14],[21,0,21,4],[20,6,20,8],[20,9,20,14],[20,0,20,4],[19,0,19,4],[18,0,18,4],[17,0,17,4],[16,9,16,14],[16,6,16,8],[16,0,16,4],[21,6,21,8],[21,9,21,14],[17,6,17,8],[17,9,17,14],[18,6,18,8],[18,9,18,14],[19,6,19,8],[19,9,19,14],[22,0,25,2],[22,3,25,23],[27,0,27,23],[28,12,28,20],[28,21,28,23],[29,0,29,4],[29,5,29,7],[29,8,29,10],[29,11,29,13],[29,14,29,16],[29,17,29,20],[29,21,29,23],[30,0,32,2],[30,3,30,4],[30,5,30,7],[30,8,30,10],[30,11,30,13],[30,14,30,16],[30,17,30,20],[30,21,30,23],[31,21,31,23],[32,3,32,4],[32,5,32,7],[32,8,32,10],[32,11,32,13],[32,14,32,16],[32,17,32,20],[32,21,32,23],[31,3,31,4],[31,5,31,7],[31,8,31,10],[31,11,31,13],[31,14,31,16],[31,17,31,20],[33,0,35,2],[33,3,33,4],[33,5,33,7],[33,8,33,10],[33,11,33,13],[33,14,33,16],[35,3,35,4],[35,5,35,7],[35,8,35,10],[35,11,35,13],[35,14,35,16],[33,17,33,20],[33,21,33,23],[34,3,34,4],[34,5,34,7],[34,8,34,10],[34,11,34,13],[34,14,34,16],[34,17,34,20],[34,21,34,23],[35,17,35,20],[35,21,35,23],[36,3,36,4],[36,5,36,7],[36,8,36,10],[36,11,36,13],[36,14,36,16],[36,17,36,20],[38,21,38,23],[39,0,39,2],[39,3,39,4],[39,5,39,7],[39,8,39,10],[39,11,39,13],[39,14,39,16],[39,17,39,20],[39,21,39,23],[38,3,38,4],[38,5,38,7],[38,8,38,10],[38,11,38,13],[38,14,38,16],[38,17,38,20],[36,0,38,2],[36,21,36,23],[37,3,37,4],[37,5,37,7],[37,8,37,10],[37,11,37,13],[37,14,37,16],[37,17,37,20],[37,21,37,23],[40,17,40,20],[40,21,40,23],[41,0,41,2],[41,3,41,4],[41,5,41,7],[41,8,41,10],[41,11,41,13],[41,14,41,16],[41,17,41,20],[41,21,41,23],[40,0,40,2],[40,3,40,4],[40,5,40,7],[40,8,40,10],[40,11,40,13],[40,14,40,16],[45,0,45,3],[45,4,45,14],[45,15,45,16],[45,17,45,18],[45,19,45,21],[45,22,45,23],[42,0,42,23],[43,0,44,3],[43,4,44,14],[43,15,43,18],[43,19,43,23],[44,15,44,16],[44,17,44,18],[44,19,44,21],[44,22,44,23],[47,0,47,3],[47,4,47,14],[47,15,47,16],[47,17,47,18],[47,19,47,21],[47,22,47,23],[46,0,46,3],[46,4,46,14],[46,15,46,16],[46,17,46,18],[46,19,46,21],[46,22,46,23],[49,0,49,3],[49,4,49,14],[49,15,49,16],[49,17,49,18],[49,19,49,21],[49,22,49,23],[48,0,48,3],[48,4,48,14],[48,15,48,16],[48,17,48,18],[48,19,48,21],[48,22,48,23],[52,0,52,23],[53,0,53,23],[54,0,54,6],[54,7,54,10],[54,11,54,14],[54,15,54,18],[54,19,54,23],[50,0,50,3],[50,4,50,14],[50,15,50,16],[50,17,50,18],[50,19,50,21],[50,22,50,23],[56,22,57,23],[57,0,57,6],[57,7,57,8],[57,9,57,10],[57,11,57,12],[57,13,57,14],[57,15,57,16],[57,17,57,18],[55,19,55,21],[55,22,55,23],[56,0,56,6],[56,7,56,8],[56,9,56,10],[56,11,56,12],[56,13,56,14],[56,15,56,16],[56,17,56,18],[56,19,57,21],[55,7,55,8],[55,9,55,10],[55,11,55,12],[55,13,55,14],[55,15,55,16],[55,17,55,18],[58,0,58,23],[59,0,59,3],[59,4,59,9],[59,10,59,16],[59,17,59,23],[60,0,60,3],[60,4,60,9],[60,10,60,16],[60,17,60,23],[63,0,63,3],[63,4,63,9],[63,10,63,16],[63,17,63,23],[64,0,64,3],[64,4,64,9],[64,10,64,16],[64,17,64,23],[61,0,61,3],[61,4,61,9],[61,10,61,16],[61,17,61,23],[62,0,62,3],[62,4,62,9],[62,10,62,16],[62,17,62,23],[69,0,69,3],[69,4,69,23],[70,0,70,3],[70,4,70,23],[71,0,71,3],[71,4,71,23],[65,0,65,3],[65,4,65,9],[65,10,65,16],[65,17,65,23],[67,0,67,23],[68,0,68,23],[77,0,77,23],[78,0,78,23],[79,0,79,23],[81,0,81,23],[82,0,82,23],[83,0,83,3],[83,4,83,6],[83,7,83,23],[72,0,72,3],[72,4,72,23],[73,0,73,3],[73,4,73,23],[74,0,74,3],[74,4,74,23],[86,0,86,3],[86,4,86,6],[86,7,86,23],[87,0,87,3],[87,4,87,6],[87,7,87,23],[84,0,84,3],[84,4,84,6],[84,7,84,23],[85,0,85,3],[85,4,85,6],[85,7,85,23],[91,0,91,23],[92,0,92,23],[93,0,93,2],[93,3,93,23],[94,0,94,1],[94,2,94,23],[88,0,88,3],[88,4,88,6],[88,7,88,23],[89,0,89,3],[89,4,89,6],[89,7,89,23],[95,0,95,1],[95,2,95,6],[95,7,95,9],[95,10,95,20],[95,22,95,23],[96,0,96,1],[96,2,96,6],[96,7,96,9],[96,10,96,20],[96,22,96,23]]}
["Florida Department of Transportation",null,null,null,null,null,null,null,null,null,null,null,null,null,"Intersection Control Evaluation Form 750-010-003"]
["Intersection Control Evaluation (ICE) Form"]
["Stage 2: Initial Control Strategy Assessment"]
["To fulfill the requirements of Stage 2 (Intersection Control Strategy) of FDOT's ICE procedures, complete the following form and append all supporting  documentation. Completed forms can be submitted to the District Traffic Operations Engineer (DTOE) and District Design Engineer (DDE) for the project's approval."]
["Project Name",null,{"$f":"IF('Stage 1'!C5=\"\",\"\",'Stage 1'!C5)","v":""},null,null,null,null,null,null,"FDOT Project #",null,null,{"$f":"IF('Stage 1'!N5=\"\",\"\",'Stage 1'!N5)","v":""},null,null,null,null,null,"Date"]
["Submitted By",null,{"$f":"IF('Stage 1'!C6=\"\",\"\",'Stage 1'!C6)","v":""},null,null,null,null,"Agency/Company",null,null,null,{"$f":"IF('Stage 1'!K6=\"\",\"\",'Stage 1'!K6)","v":""},null,null,null,null,null,"Email",{"$f":"IF('Stage 1'!C7=\"\",\"\",'Stage 1'!C7)","v":""}]
{"$rows_left_out":92}
{"sheet":"Stage 3","index":3,"n_rows":42,"n_cols":16,"rows_kept":42,"cut":false,"hidden":true,"merged":[[38,0,38,2],[17,0,17,2],[17,3,17,16],[18,0,18,2],[19,0,19,2],[20,0,20,2],[28,0,28,16],[23,0,23,16],[9,0,9,16],[13,0,13,2],[14,0,14,2],[24,0,24,16],[25,0,25,16],[15,0,15,2],[13,3,13,16],[14,3,14,16],[15,3,15,16],[11,0,11,2],[11,3,11,16],[21,0,21,2],[18,3,18,16],[19,3,19,16],[20,3,20,16],[21,3,21,16],[10,0,10,16],[36,0,36,16],[37,0,37,16],[16,0,16,16],[12,0,12,2],[12,3,12,16],[29,0,29,16],[31,0,31,3],[31,4,31,5],[31,6,31,16],[32,0,32,3],[32,4,32,5],[32,6,32,16],[33,0,33,3],[6,0,6,16],[7,0,7,4],[7,5,7,10],[7,11,7,16],[4,0,4,1],[4,2,4,7],[4,8,4,9],[4,10,4,14],[5,0,5,1],[5,2,5,5],[5,6,5,8],[5,9,5,12],[5,14,5,16],[0,0,0,10],[0,11,0,16],[1,0,1,11],[2,0,2,11],[3,0,3,16],[41,0,41,1],[40,0,40,1],[30,0,30,3],[30,4,30,5],[30,6,30,16],[40,2,40,6],[40,9,40,14],[41,2,41,6],[41,9,41,14],[38,3,38,16],[39,0,39,1],[39,2,39,16],[33,4,33,5],[33,6,33,16],[40,7,40,8],[41,7,41,8]]}
["Florida Department of Transportation",null,null,null,null,null,null,null,null,null,null,"Intersection Control Evaluation Form 750-010-003"]
["Intersection Control Evaluation (ICE) Form"]
["Stage 3: Detailed Control Strategy Assessment"]
["To fulfill the requirements of Stage 3 (Detailed Control Strategy Assessment) of FDOT's ICE procedures, complete the following form and append all supporting documentation, which may include detailed design plans of each control strategy analyzed. Completed forms can be submitted to the District Traffic Operations Engineer (DTOE) and District Design Engineer (DDE) for the project's approval."]
["Project Name",null,{"$f":"IF('Stage 1'!C5=\"\",\"\",'Stage 1'!C5)","v":""},null,null,null,null,null,"FDOT Project #",null,{"$f":"IF('Stage 1'!N5=\"\",\"\",'Stage 1'!N5)","v":""},null,null,null,null,"Date"]
["Submitted By",null,{"$f":"IF('Stage 1'!C6=\"\",\"\",'Stage 1'!C6)","v":""},null,null,null,"Agency/Company",null,null,{"$f":"IF('Stage 1'!K6=\"\",\"\",'Stage 1'!K6)","v":""},null,null,null,"Email",{"$f":"IF('Stage 1'!C7=\"\",\"\",'Stage 1'!C7)","v":""}]
{"$rows_left_out":37}
{"sheet":"List","index":4,"n_rows":67,"n_cols":29,"rows_kept":67,"cut":false,"hidden":true,"merged":[]}
["Northbound","C1 - Natural","Alachua","District 1","Safety Improvement Project","Two-way Stop-Control","Urban Principal Arterial","Both sides of the approach","Yes","Identified Control Strategy Approved","Two-way stop control","Low","A","Construction Only","Identified Control Strategy Approved","Operations","Identified Alternative Approved",1,{"$f":"IF('Stage 1'!J72:K72=\"Yes\",'Stage 1'!A72:B72,\"\")","v":""},{"$f":"IFERROR(INDEX($S$1:$S$13,SMALL(IF($S$1:$S$13<>\"\",ROW($S$1:$S$13)),ROW(T1))),\"\")","v":""},{"$f":"IF('Stage 1'!$F$9=\"Federal\",IF('Stage 2_Fed'!E105=\"YES\",'Stage 2_Fed'!A105,\"\"),IF('Stage 2_NonFed'!E85=\"YES\",'Stage 2_NonFed'!A85,\"\"))","v":""},{"$f":"IFERROR(INDEX($U$1:$U$6,SMALL(IF($U$1:$U$6<>\"\",ROW($U$1:$U$6)),ROW(V1))),\"\")","v":""},"Passenger car (P)","Weekday AM Peak",null,null,null,"Test1","Federal"]
["Southbound","C2 - Rural","Baker","District 2","Congestion Mitigation Project","All-way Stop-Control","Urban Minor Arterial","One side of the approach","No","Identified Control Strategy Not Approved (Re-evaluate)","All-way stop control","Medium","B","PE & Construction","Identified Control Strategy Not Approved (Re-evaluate control strategies)","Costs","Identified Alternative Not Approved (Re-evaluate control strategies)",2,{"$f":"IF('Stage 1'!J73:K73=\"Yes\",'Stage 1'!A73:B73,\"\")","v":""},{"$f":"IFERROR(INDEX($S$1:$S$13,SMALL(IF($S$1:$S$13<>\"\",ROW($S$1:$S$13)),ROW(T2))),\"\")","v":""},{"$f":"IF('Stage 1'!$F$9=\"Federal\",IF('Stage 2_Fed'!E106=\"YES\",'Stage 2_Fed'!A106,\"\"),IF('Stage 2_NonFed'!E86=\"YES\",'Stage 2_NonFed'!A86,\"\"))","v":""},{"$f":"IFERROR(INDEX($U$1:$U$6,SMALL(IF($U$1:$U$6<>\"\",ROW($U$1:$U$6)),ROW(V2))),\"\")","v":""},"Single Unit Truck (SU)","Weekday Midday Peak",null,null,null,"Test2","Non-federal"]
["Eastbound","C2T - Rural Town","Bay","District 3","Corridor Improvement Project","Signal","Urban Major Collector","Neither side of the approach",null,"Multiple Viable Alternatives Identified: Continue to Stage 2","Traffic Signal","High","C","ROW & Construction","Multiple Viable Alternatives Identified: Continue to Stage 3","Safety Performance",null,3,{"$f":"IF('Stage 1'!J74:K74=\"Yes\",'Stage 1'!A74:B74,\"\")","v":""},{"$f":"IFERROR(INDEX($S$1:$S$13,SMALL(IF($S$1:$S$13<>\"\",ROW($S$1:$S$13)),ROW(T3))),\"\")","v":""},{"$f":"IF('Stage 1'!$F$9=\"Federal\",IF('Stage 2_Fed'!E107=\"YES\",'Stage 2_Fed'!A107,\"\"),IF('Stage 2_NonFed'!E87=\"YES\",'Stage 2_NonFed'!A87,\"\"))","v":""},{"$f":"IFERROR(INDEX($U$1:$U$6,SMALL(IF($U$1:$U$6<>\"\",ROW($U$1:$U$6)),ROW(V3))),\"\")","v":""},"Inter-city Bus (BUS-40)","Weekday PM Peak"]
["Westbound","C3R - Suburban Residential","Bradford","District 4","Land Development Project","Roundabout","Urban Minor Collector",null,null,null,"Roundabout",null,"D","PE, ROW, & Construction",null,"Bicycle/Pedestrian Accommodations",null,4,{"$f":"IF('Stage 1'!J75:K75=\"Yes\",'Stage 1'!A75:B75,\"\")","v":""},{"$f":"IFERROR(INDEX($S$1:$S$13,SMALL(IF($S$1:$S$13<>\"\",ROW($S$1:$S$13)),ROW(T4))),\"\")","v":""},{"$f":"IF('Stage 1'!$F$9=\"Federal\",IF('Stage 2_Fed'!E108=\"YES\",'Stage 2_Fed'!A108,\"\"),IF('Stage 2_NonFed'!E88=\"YES\",'Stage 2_NonFed'!A88,\"\"))","v":""},{"$f":"IFERROR(INDEX($U$1:$U$6,SMALL(IF($U$1:$U$6<>\"\",ROW($U$1:$U$6)),ROW(V4))),\"\")","v":""},"Inter-city Bus (BUS-45)","Saturday AM Peak"]
["Northeastbound","C3C - Suburban Commercial","Brevard","District 5","Community/Streetscape Improvement","None/New Intersection","Urban Local",null,null,null,"Median U-Turn",null,"E","PE, ROW, Construction, Contingency",null,"Transit Services",null,5,{"$f":"IF('Stage 1'!J76:K76=\"Yes\",'Stage 1'!A76:B76,\"\")","v":""},{"$f":"IFERROR(INDEX($S$1:$S$13,SMALL(IF($S$1:$S$13<>\"\",ROW($S$1:$S$13)),ROW(T5))),\"\")","v":""},{"$f":"IF('Stage 1'!$F$9=\"Federal\",IF('Stage 2_Fed'!E109=\"YES\",'Stage 2_Fed'!A109,\"\"),IF('Stage 2_NonFed'!E89=\"YES\",'Stage 2_NonFed'!A89,\"\"))","v":""},null,"City Transit Bus (CITY-BUS)","Saturday Midday Peak"]
["Southeastbound","C4 - Urban General","Broward","District 6","Multimodal Improvement","Other","Rural Principal Arterial",null,null,null,"RCUT (Signalized)",null,"F",null,null,"Environmental",null,6,{"$f":"IF('Stage 1'!J77:K77=\"Yes\",'Stage 1'!A77:B77,\"\")","v":""},{"$f":"IFERROR(INDEX($S$1:$S$13,SMALL(IF($S$1:$S$13<>\"\",ROW($S$1:$S$13)),ROW(T6))),\"\")","v":""},{"$f":"IF('Stage 1'!$F$9=\"Federal\",IF('Stage 2_Fed'!E110=\"YES\",'Stage 2_Fed'!A110,\"\"),IF('Stage 2_NonFed'!E90=\"YES\",'Stage 2_NonFed'!A90,\"\"))","v":""},null,"School Bus (S-BUS-36)","Saturday PM Peak"]
{"$rows_left_out":61}