{"text_format":"1","workbook":"xlsx","n_sheets":2,"sheets":["Fiber Device (Desc)","Fiber Device (Code)"],"not_rendered":{"charts":0,"images":0,"macros":1,"external_links":1,"defined_names":9,"comments":0,"pivot_tables":0},"unopened":[],"bounds":{"document_bytes":16777216,"sheet_cells":100000,"rows_first":2000,"rows_last":500,"rows_between":2000,"halvings":0,"cell_chars":16384,"cell_head_chars":4096},"cells_cut":0,"cells_raw":0,"read":"whole","date_system":"1900"}

{"sheet":"Fiber Device (Desc)","index":0,"n_rows":2,"n_cols":18,"rows_kept":2,"cut":false,"hidden":false,"merged":[]}
["Device Id\nfor update ","Site Identification Name\nSignal Equipment Cabinet SIN","Equipment Location Id ","Previous Name","Fiber Device Type","Installed Date \n(YYYYMMDD)","Comments","Manufacturer ","Model ","Serial Number ","IP Address ","MAC Address ","Firmware Version ","Fiber Mode","Copper Ports (Out) ","Trunk Ports","Derived Ports","Fiber Connector Type"]
["EQUIP_ID","This Field is for Reference Only     DO NOT IMPORT","EQUIP_LOC_ID               REQUIRED FIELD","This Field is for Reference Only DO NOT IMPORT","FIBER_DEV_TYPE_CD REQUIRED FIELD","YEAR_INSTALLED","NAME","FIBER_DEV_MANUF_CD","FIBER_DEV_MODEL_CD","SERIAL_NUMBER ","IP_ADDRESS","MAC_ADDRESS","FIRMWARE_VERSION","FIBER_DEV_MODE_CD","COPPER_PORTS_OUT","TRUNK_PORTS REQUIRED FIELD","DERIVED_PORTS REQUIRED FIELD","FIBER_CONN_TYPE_CD "]

{"sheet":"Fiber Device (Code)","index":1,"n_rows":202,"n_cols":17,"rows_kept":202,"cut":false,"hidden":false,"merged":[]}
["Device Id\nfor update ","Structure Entity Code","Equipment Location Id ","Fiber Device Type","Installed Date (yyyy-mm-dd)","Comments","Manufacturer ","Model ","Serial Number ","IP Address ","MAC Address ","Firmware Version","Fiber Mode","Copper Ports (Out) ","Trunk Ports","Derived Ports","Fiber Connector Type"]
["EQUIP_ID","Entity_CD                       REQUIRED FIELD","EQUIP_LOC_ID                 EQUIRED FIELD","FIBER_DEV_TYPE_CD REQUIRED FIELD","YEAR_INSTALLED","NAME","FIBER_DEV_MANUF_CD","FIBER_DEV_MODEL_CD","SERIAL_NUMBER","IP_ADDRESS","MAC_ADDRESS","FIRMWARE_VERSION","FIBER_DEV_MODE_CD","COPPER_PORTS_OUT","TRUNK_PORTS REQUIRED FIELD","DERIVED_PORTS REQUIRED FIELD","FIBER_CONN_TYPE_CD"]
[{"$f":"IF('Fiber Device (Desc)'!A3=\"\",\"\",'Fiber Device (Desc)'!A3)","v":""},{"$f":"IF('Fiber Device (Desc)'!C3=\"\",\"\",\"2029\")","v":""},{"$f":"IF('Fiber Device (Desc)'!C3=\"\",\"\",'Fiber Device (Desc)'!C3)","v":""},{"$f":"IF('Fiber Device (Desc)'!E3=\"\",\"\",INDEX([1]FIBER_DEV_TYPE!$A$2:$A$100,MATCH('Fiber Device (Desc)'!$E3,[1]!MASTER_FIBER_DEV_TYPE_DESC[#Data],0),0))","v":""},{"$f":"IF('Fiber Device (Desc)'!F3=\"\",\"\",'Fiber Device (Desc)'!F3)","v":""},{"$f":"IF('Fiber Device (Desc)'!G3=\"\",\"\",'Fiber Device (Desc)'!G3)","v":""},{"$f":"IF('Fiber Device (Desc)'!H3=\"\",\"\",INDEX([1]FIBER_DEV_MANUF!$A$2:$A$500,MATCH(1,([1]FIBER_DEV_MANUF!$C$2:$C$500=$D3)*([1]FIBER_DEV_MANUF!$B$2:$B$500='Fiber Device (Desc)'!$H3),0)))","v":""},{"$f":"IF('Fiber Device (Desc)'!I3=\"\",\"\",INDEX([1]FIBER_DEV_MODEL!$A$2:$A$500,MATCH(1,([1]FIBER_DEV_MODEL!$C$2:$C$500='Fiber Device (Desc)'!$H3)*([1]FIBER_DEV_MODEL!$E$2:$E$500='Fiber Device (Desc)'!$I3)*([1]FIBER_DEV_MODEL!$D$2:$D$500=$D3),0),0))","v":""},{"$f":"IF('Fiber Device (Desc)'!J3=\"\",\"\",'Fiber Device (Desc)'!J3)","v":""},{"$f":"IF('Fiber Device (Desc)'!K3=\"\",\"\",'Fiber Device (Desc)'!K3)","v":""},{"$f":"IF('Fiber Device (Desc)'!L3=\"\",\"\",'Fiber Device (Desc)'!L3)","v":""},{"$f":"IF('Fiber Device (Desc)'!M3=\"\",\"\",'Fiber Device (Desc)'!M3)","v":""},{"$f":"IF('Fiber Device (Desc)'!N3=\"\",\"\",INDEX([1]FIBER_DEV_MODE!$A$2:$A$100,MATCH('Fiber Device (Desc)'!$N3,[1]!MASTER_FIBER_DEV_MODE_DESC[#Data],0),0))","v":""},{"$f":"IF('Fiber Device (Desc)'!O3=\"\",\"\",'Fiber Device (Desc)'!O3)","v":""},{"$f":"IF('Fiber Device (Desc)'!P3=\"\",\"\",'Fiber Device (Desc)'!P3)","v":""},{"$f":"IF('Fiber Device (Desc)'!Q3=\"\",\"\",'Fiber Device (Desc)'!Q3)","v":""},{"$f":"IF('Fiber Device (Desc)'!R3=\"\",\"\",INDEX([1]FIBER_CONN_TYPE!$A$2:$A$100,MATCH('Fiber Device (Desc)'!$R3,[1]!MASTER_FIBER_CONN_TYPE_DESC[#Data],0),0))","v":""}]
[{"$f":"IF('Fiber Device (Desc)'!A4=\"\",\"\",'Fiber Device (Desc)'!A4)","v":""},{"$f":"IF('Fiber Device (Desc)'!C4=\"\",\"\",\"2029\")","v":""},{"$f":"IF('Fiber Device (Desc)'!C4=\"\",\"\",'Fiber Device (Desc)'!C4)","v":""},{"$f":"IF('Fiber Device (Desc)'!E4=\"\",\"\",INDEX([1]FIBER_DEV_TYPE!$A$2:$A$100,MATCH('Fiber Device (Desc)'!$E4,[1]!MASTER_FIBER_DEV_TYPE_DESC[#Data],0),0))","v":""},{"$f":"IF('Fiber Device (Desc)'!F4=\"\",\"\",'Fiber Device (Desc)'!F4)","v":""},{"$f":"IF('Fiber Device (Desc)'!G4=\"\",\"\",'Fiber Device (Desc)'!G4)","v":""},{"$f":"IF('Fiber Device (Desc)'!H4=\"\",\"\",INDEX([1]FIBER_DEV_MANUF!$A$2:$A$500,MATCH(1,([1]FIBER_DEV_MANUF!$C$2:$C$500=$D4)*([1]FIBER_DEV_MANUF!$B$2:$B$500='Fiber Device (Desc)'!$H4),0)))","v":""},{"$f":"IF('Fiber Device (Desc)'!I4=\"\",\"\",INDEX([1]FIBER_DEV_MODEL!$A$2:$A$500,MATCH(1,([1]FIBER_DEV_MODEL!$C$2:$C$500='Fiber Device (Desc)'!$H4)*([1]FIBER_DEV_MODEL!$E$2:$E$500='Fiber Device (Desc)'!$I4)*([1]FIBER_DEV_MODEL!$D$2:$D$500=$D4),0),0))","v":""},{"$f":"IF('Fiber Device (Desc)'!J4=\"\",\"\",'Fiber Device (Desc)'!J4)","v":""},{"$f":"IF('Fiber Device (Desc)'!K4=\"\",\"\",'Fiber Device (Desc)'!K4)","v":""},{"$f":"IF('Fiber Device (Desc)'!L4=\"\",\"\",'Fiber Device (Desc)'!L4)","v":""},{"$f":"IF('Fiber Device (Desc)'!M4=\"\",\"\",'Fiber Device (Desc)'!M4)","v":""},{"$f":"IF('Fiber Device (Desc)'!N4=\"\",\"\",INDEX([1]FIBER_DEV_MODE!$A$2:$A$100,MATCH('Fiber Device (Desc)'!$N4,[1]!MASTER_FIBER_DEV_MODE_DESC[#Data],0),0))","v":""},{"$f":"IF('Fiber Device (Desc)'!O4=\"\",\"\",'Fiber Device (Desc)'!O4)","v":""},{"$f":"IF('Fiber Device (Desc)'!P4=\"\",\"\",'Fiber Device (Desc)'!P4)","v":""},{"$f":"IF('Fiber Device (Desc)'!Q4=\"\",\"\",'Fiber Device (Desc)'!Q4)","v":""},{"$f":"IF('Fiber Device (Desc)'!R4=\"\",\"\",INDEX([1]FIBER_CONN_TYPE!$A$2:$A$100,MATCH('Fiber Device (Desc)'!$R4,[1]!MASTER_FIBER_CONN_TYPE_DESC[#Data],0),0))","v":""}]
[{"$f":"IF('Fiber Device (Desc)'!A5=\"\",\"\",'Fiber Device (Desc)'!A5)","v":""},{"$f":"IF('Fiber Device (Desc)'!C5=\"\",\"\",\"2029\")","v":""},{"$f":"IF('Fiber Device (Desc)'!C5=\"\",\"\",'Fiber Device (Desc)'!C5)","v":""},{"$f":"IF('Fiber Device (Desc)'!E5=\"\",\"\",INDEX([1]FIBER_DEV_TYPE!$A$2:$A$100,MATCH('Fiber Device (Desc)'!$E5,[1]!MASTER_FIBER_DEV_TYPE_DESC[#Data],0),0))","v":""},{"$f":"IF('Fiber Device (Desc)'!F5=\"\",\"\",'Fiber Device (Desc)'!F5)","v":""},{"$f":"IF('Fiber Device (Desc)'!G5=\"\",\"\",'Fiber Device (Desc)'!G5)","v":""},{"$f":"IF('Fiber Device (Desc)'!H5=\"\",\"\",INDEX([1]FIBER_DEV_MANUF!$A$2:$A$500,MATCH(1,([1]FIBER_DEV_MANUF!$C$2:$C$500=$D5)*([1]FIBER_DEV_MANUF!$B$2:$B$500='Fiber Device (Desc)'!$H5),0)))","v":""},{"$f":"IF('Fiber Device (Desc)'!I5=\"\",\"\",INDEX([1]FIBER_DEV_MODEL!$A$2:$A$500,MATCH(1,([1]FIBER_DEV_MODEL!$C$2:$C$500='Fiber Device (Desc)'!$H5)*([1]FIBER_DEV_MODEL!$E$2:$E$500='Fiber Device (Desc)'!$I5)*([1]FIBER_DEV_MODEL!$D$2:$D$500=$D5),0),0))","v":""},{"$f":"IF('Fiber Device (Desc)'!J5=\"\",\"\",'Fiber Device (Desc)'!J5)","v":""},{"$f":"IF('Fiber Device (Desc)'!K5=\"\",\"\",'Fiber Device (Desc)'!K5)","v":""},{"$f":"IF('Fiber Device (Desc)'!L5=\"\",\"\",'Fiber Device (Desc)'!L5)","v":""},{"$f":"IF('Fiber Device (Desc)'!M5=\"\",\"\",'Fiber Device (Desc)'!M5)","v":""},{"$f":"IF('Fiber Device (Desc)'!N5=\"\",\"\",INDEX([1]FIBER_DEV_MODE!$A$2:$A$100,MATCH('Fiber Device (Desc)'!$N5,[1]!MASTER_FIBER_DEV_MODE_DESC[#Data],0),0))","v":""},{"$f":"IF('Fiber Device (Desc)'!O5=\"\",\"\",'Fiber Device (Desc)'!O5)","v":""},{"$f":"IF('Fiber Device (Desc)'!P5=\"\",\"\",'Fiber Device (Desc)'!P5)","v":""},{"$f":"IF('Fiber Device (Desc)'!Q5=\"\",\"\",'Fiber Device (Desc)'!Q5)","v":""},{"$f":"IF('Fiber Device (Desc)'!R5=\"\",\"\",INDEX([1]FIBER_CONN_TYPE!$A$2:$A$100,MATCH('Fiber Device (Desc)'!$R5,[1]!MASTER_FIBER_CONN_TYPE_DESC[#Data],0),0))","v":""}]
[{"$f":"IF('Fiber Device (Desc)'!A6=\"\",\"\",'Fiber Device (Desc)'!A6)","v":""},{"$f":"IF('Fiber Device (Desc)'!C6=\"\",\"\",\"2029\")","v":""},{"$f":"IF('Fiber Device (Desc)'!C6=\"\",\"\",'Fiber Device (Desc)'!C6)","v":""},{"$f":"IF('Fiber Device (Desc)'!E6=\"\",\"\",INDEX([1]FIBER_DEV_TYPE!$A$2:$A$100,MATCH('Fiber Device (Desc)'!$E6,[1]!MASTER_FIBER_DEV_TYPE_DESC[#Data],0),0))","v":""},{"$f":"IF('Fiber Device (Desc)'!F6=\"\",\"\",'Fiber Device (Desc)'!F6)","v":""},{"$f":"IF('Fiber Device (Desc)'!G6=\"\",\"\",'Fiber Device (Desc)'!G6)","v":""},{"$f":"IF('Fiber Device (Desc)'!H6=\"\",\"\",INDEX([1]FIBER_DEV_MANUF!$A$2:$A$500,MATCH(1,([1]FIBER_DEV_MANUF!$C$2:$C$500=$D6)*([1]FIBER_DEV_MANUF!$B$2:$B$500='Fiber Device (Desc)'!$H6),0)))","v":""},{"$f":"IF('Fiber Device (Desc)'!I6=\"\",\"\",INDEX([1]FIBER_DEV_MODEL!$A$2:$A$500,MATCH(1,([1]FIBER_DEV_MODEL!$C$2:$C$500='Fiber Device (Desc)'!$H6)*([1]FIBER_DEV_MODEL!$E$2:$E$500='Fiber Device (Desc)'!$I6)*([1]FIBER_DEV_MODEL!$D$2:$D$500=$D6),0),0))","v":""},{"$f":"IF('Fiber Device (Desc)'!J6=\"\",\"\",'Fiber Device (Desc)'!J6)","v":""},{"$f":"IF('Fiber Device (Desc)'!K6=\"\",\"\",'Fiber Device (Desc)'!K6)","v":""},{"$f":"IF('Fiber Device (Desc)'!L6=\"\",\"\",'Fiber Device (Desc)'!L6)","v":""},{"$f":"IF('Fiber Device (Desc)'!M6=\"\",\"\",'Fiber Device (Desc)'!M6)","v":""},{"$f":"IF('Fiber Device (Desc)'!N6=\"\",\"\",INDEX([1]FIBER_DEV_MODE!$A$2:$A$100,MATCH('Fiber Device (Desc)'!$N6,[1]!MASTER_FIBER_DEV_MODE_DESC[#Data],0),0))","v":""},{"$f":"IF('Fiber Device (Desc)'!O6=\"\",\"\",'Fiber Device (Desc)'!O6)","v":""},{"$f":"IF('Fiber Device (Desc)'!P6=\"\",\"\",'Fiber Device (Desc)'!P6)","v":""},{"$f":"IF('Fiber Device (Desc)'!Q6=\"\",\"\",'Fiber Device (Desc)'!Q6)","v":""},{"$f":"IF('Fiber Device (Desc)'!R6=\"\",\"\",INDEX([1]FIBER_CONN_TYPE!$A$2:$A$100,MATCH('Fiber Device (Desc)'!$R6,[1]!MASTER_FIBER_CONN_TYPE_DESC[#Data],0),0))","v":""}]
[{"$f":"IF('Fiber Device (Desc)'!A7=\"\",\"\",'Fiber Device (Desc)'!A7)","v":""},{"$f":"IF('Fiber Device (Desc)'!C7=\"\",\"\",\"2029\")","v":""},{"$f":"IF('Fiber Device (Desc)'!C7=\"\",\"\",'Fiber Device (Desc)'!C7)","v":""},{"$f":"IF('Fiber Device (Desc)'!E7=\"\",\"\",INDEX([1]FIBER_DEV_TYPE!$A$2:$A$100,MATCH('Fiber Device (Desc)'!$E7,[1]!MASTER_FIBER_DEV_TYPE_DESC[#Data],0),0))","v":""},{"$f":"IF('Fiber Device (Desc)'!F7=\"\",\"\",'Fiber Device (Desc)'!F7)","v":""},{"$f":"IF('Fiber Device (Desc)'!G7=\"\",\"\",'Fiber Device (Desc)'!G7)","v":""},{"$f":"IF('Fiber Device (Desc)'!H7=\"\",\"\",INDEX([1]FIBER_DEV_MANUF!$A$2:$A$500,MATCH(1,([1]FIBER_DEV_MANUF!$C$2:$C$500=$D7)*([1]FIBER_DEV_MANUF!$B$2:$B$500='Fiber Device (Desc)'!$H7),0)))","v":""},{"$f":"IF('Fiber Device (Desc)'!I7=\"\",\"\",INDEX([1]FIBER_DEV_MODEL!$A$2:$A$500,MATCH(1,([1]FIBER_DEV_MODEL!$C$2:$C$500='Fiber Device (Desc)'!$H7)*([1]FIBER_DEV_MODEL!$E$2:$E$500='Fiber Device (Desc)'!$I7)*([1]FIBER_DEV_MODEL!$D$2:$D$500=$D7),0),0))","v":""},{"$f":"IF('Fiber Device (Desc)'!J7=\"\",\"\",'Fiber Device (Desc)'!J7)","v":""},{"$f":"IF('Fiber Device (Desc)'!K7=\"\",\"\",'Fiber Device (Desc)'!K7)","v":""},{"$f":"IF('Fiber Device (Desc)'!L7=\"\",\"\",'Fiber Device (Desc)'!L7)","v":""},{"$f":"IF('Fiber Device (Desc)'!M7=\"\",\"\",'Fiber Device (Desc)'!M7)","v":""},{"$f":"IF('Fiber Device (Desc)'!N7=\"\",\"\",INDEX([1]FIBER_DEV_MODE!$A$2:$A$100,MATCH('Fiber Device (Desc)'!$N7,[1]!MASTER_FIBER_DEV_MODE_DESC[#Data],0),0))","v":""},{"$f":"IF('Fiber Device (Desc)'!O7=\"\",\"\",'Fiber Device (Desc)'!O7)","v":""},{"$f":"IF('Fiber Device (Desc)'!P7=\"\",\"\",'Fiber Device (Desc)'!P7)","v":""},{"$f":"IF('Fiber Device (Desc)'!Q7=\"\",\"\",'Fiber Device (Desc)'!Q7)","v":""},{"$f":"IF('Fiber Device (Desc)'!R7=\"\",\"\",INDEX([1]FIBER_CONN_TYPE!$A$2:$A$100,MATCH('Fiber Device (Desc)'!$R7,[1]!MASTER_FIBER_CONN_TYPE_DESC[#Data],0),0))","v":""}]
[{"$f":"IF('Fiber Device (Desc)'!A8=\"\",\"\",'Fiber Device (Desc)'!A8)","v":""},{"$f":"IF('Fiber Device (Desc)'!C8=\"\",\"\",\"2029\")","v":""},{"$f":"IF('Fiber Device (Desc)'!C8=\"\",\"\",'Fiber Device (Desc)'!C8)","v":""},{"$f":"IF('Fiber Device (Desc)'!E8=\"\",\"\",INDEX([1]FIBER_DEV_TYPE!$A$2:$A$100,MATCH('Fiber Device (Desc)'!$E8,[1]!MASTER_FIBER_DEV_TYPE_DESC[#Data],0),0))","v":""},{"$f":"IF('Fiber Device (Desc)'!F8=\"\",\"\",'Fiber Device (Desc)'!F8)","v":""},{"$f":"IF('Fiber Device (Desc)'!G8=\"\",\"\",'Fiber Device (Desc)'!G8)","v":""},{"$f":"IF('Fiber Device (Desc)'!H8=\"\",\"\",INDEX([1]FIBER_DEV_MANUF!$A$2:$A$500,MATCH(1,([1]FIBER_DEV_MANUF!$C$2:$C$500=$D8)*([1]FIBER_DEV_MANUF!$B$2:$B$500='Fiber Device (Desc)'!$H8),0)))","v":""},{"$f":"IF('Fiber Device (Desc)'!I8=\"\",\"\",INDEX([1]FIBER_DEV_MODEL!$A$2:$A$500,MATCH(1,([1]FIBER_DEV_MODEL!$C$2:$C$500='Fiber Device (Desc)'!$H8)*([1]FIBER_DEV_MODEL!$E$2:$E$500='Fiber Device (Desc)'!$I8)*([1]FIBER_DEV_MODEL!$D$2:$D$500=$D8),0),0))","v":""},{"$f":"IF('Fiber Device (Desc)'!J8=\"\",\"\",'Fiber Device (Desc)'!J8)","v":""},{"$f":"IF('Fiber Device (Desc)'!K8=\"\",\"\",'Fiber Device (Desc)'!K8)","v":""},{"$f":"IF('Fiber Device (Desc)'!L8=\"\",\"\",'Fiber Device (Desc)'!L8)","v":""},{"$f":"IF('Fiber Device (Desc)'!M8=\"\",\"\",'Fiber Device (Desc)'!M8)","v":""},{"$f":"IF('Fiber Device (Desc)'!N8=\"\",\"\",INDEX([1]FIBER_DEV_MODE!$A$2:$A$100,MATCH('Fiber Device (Desc)'!$N8,[1]!MASTER_FIBER_DEV_MODE_DESC[#Data],0),0))","v":""},{"$f":"IF('Fiber Device (Desc)'!O8=\"\",\"\",'Fiber Device (Desc)'!O8)","v":""},{"$f":"IF('Fiber Device (Desc)'!P8=\"\",\"\",'Fiber Device (Desc)'!P8)","v":""},{"$f":"IF('Fiber Device (Desc)'!Q8=\"\",\"\",'Fiber Device (Desc)'!Q8)","v":""},{"$f":"IF('Fiber Device (Desc)'!R8=\"\",\"\",INDEX([1]FIBER_CONN_TYPE!$A$2:$A$100,MATCH('Fiber Device (Desc)'!$R8,[1]!MASTER_FIBER_CONN_TYPE_DESC[#Data],0),0))","v":""}]
[{"$f":"IF('Fiber Device (Desc)'!A9=\"\",\"\",'Fiber Device (Desc)'!A9)","v":""},{"$f":"IF('Fiber Device (Desc)'!C9=\"\",\"\",\"2029\")","v":""},{"$f":"IF('Fiber Device (Desc)'!C9=\"\",\"\",'Fiber Device (Desc)'!C9)","v":""},{"$f":"IF('Fiber Device (Desc)'!E9=\"\",\"\",INDEX([1]FIBER_DEV_TYPE!$A$2:$A$100,MATCH('Fiber Device (Desc)'!$E9,[1]!MASTER_FIBER_DEV_TYPE_DESC[#Data],0),0))","v":""},{"$f":"IF('Fiber Device (Desc)'!F9=\"\",\"\",'Fiber Device (Desc)'!F9)","v":""},{"$f":"IF('Fiber Device (Desc)'!G9=\"\",\"\",'Fiber Device (Desc)'!G9)","v":""},{"$f":"IF('Fiber Device (Desc)'!H9=\"\",\"\",INDEX([1]FIBER_DEV_MANUF!$A$2:$A$500,MATCH(1,([1]FIBER_DEV_MANUF!$C$2:$C$500=$D9)*([1]FIBER_DEV_MANUF!$B$2:$B$500='Fiber Device (Desc)'!$H9),0)))","v":""},{"$f":"IF('Fiber Device (Desc)'!I9=\"\",\"\",INDEX([1]FIBER_DEV_MODEL!$A$2:$A$500,MATCH(1,([1]FIBER_DEV_MODEL!$C$2:$C$500='Fiber Device (Desc)'!$H9)*([1]FIBER_DEV_MODEL!$E$2:$E$500='Fiber Device (Desc)'!$I9)*([1]FIBER_DEV_MODEL!$D$2:$D$500=$D9),0),0))","v":""},{"$f":"IF('Fiber Device (Desc)'!J9=\"\",\"\",'Fiber Device (Desc)'!J9)","v":""},{"$f":"IF('Fiber Device (Desc)'!K9=\"\",\"\",'Fiber Device (Desc)'!K9)","v":""},{"$f":"IF('Fiber Device (Desc)'!L9=\"\",\"\",'Fiber Device (Desc)'!L9)","v":""},{"$f":"IF('Fiber Device (Desc)'!M9=\"\",\"\",'Fiber Device (Desc)'!M9)","v":""},{"$f":"IF('Fiber Device (Desc)'!N9=\"\",\"\",INDEX([1]FIBER_DEV_MODE!$A$2:$A$100,MATCH('Fiber Device (Desc)'!$N9,[1]!MASTER_FIBER_DEV_MODE_DESC[#Data],0),0))","v":""},{"$f":"IF('Fiber Device (Desc)'!O9=\"\",\"\",'Fiber Device (Desc)'!O9)","v":""},{"$f":"IF('Fiber Device (Desc)'!P9=\"\",\"\",'Fiber Device (Desc)'!P9)","v":""},{"$f":"IF('Fiber Device (Desc)'!Q9=\"\",\"\",'Fiber Device (Desc)'!Q9)","v":""},{"$f":"IF('Fiber Device (Desc)'!R9=\"\",\"\",INDEX([1]FIBER_CONN_TYPE!$A$2:$A$100,MATCH('Fiber Device (Desc)'!$R9,[1]!MASTER_FIBER_CONN_TYPE_DESC[#Data],0),0))","v":""}]
[{"$f":"IF('Fiber Device (Desc)'!A10=\"\",\"\",'Fiber Device (Desc)'!A10)","v":""},{"$f":"IF('Fiber Device (Desc)'!C10=\"\",\"\",\"2029\")","v":""},{"$f":"IF('Fiber Device (Desc)'!C10=\"\",\"\",'Fiber Device (Desc)'!C10)","v":""},{"$f":"IF('Fiber Device (Desc)'!E10=\"\",\"\",INDEX([1]FIBER_DEV_TYPE!$A$2:$A$100,MATCH('Fiber Device (Desc)'!$E10,[1]!MASTER_FIBER_DEV_TYPE_DESC[#Data],0),0))","v":""},{"$f":"IF('Fiber Device (Desc)'!F10=\"\",\"\",'Fiber Device (Desc)'!F10)","v":""},{"$f":"IF('Fiber Device (Desc)'!G10=\"\",\"\",'Fiber Device (Desc)'!G10)","v":""},{"$f":"IF('Fiber Device (Desc)'!H10=\"\",\"\",INDEX([1]FIBER_DEV_MANUF!$A$2:$A$500,MATCH(1,([1]FIBER_DEV_MANUF!$C$2:$C$500=$D10)*([1]FIBER_DEV_MANUF!$B$2:$B$500='Fiber Device (Desc)'!$H10),0)))","v":""},{"$f":"IF('Fiber Device (Desc)'!I10=\"\",\"\",INDEX([1]FIBER_DEV_MODEL!$A$2:$A$500,MATCH(1,([1]FIBER_DEV_MODEL!$C$2:$C$500='Fiber Device (Desc)'!$H10)*([1]FIBER_DEV_MODEL!$E$2:$E$500='Fiber Device (Desc)'!$I10)*([1]FIBER_DEV_MODEL!$D$2:$D$500=$D10),0),0))","v":""},{"$f":"IF('Fiber Device (Desc)'!J10=\"\",\"\",'Fiber Device (Desc)'!J10)","v":""},{"$f":"IF('Fiber Device (Desc)'!K10=\"\",\"\",'Fiber Device (Desc)'!K10)","v":""},{"$f":"IF('Fiber Device (Desc)'!L10=\"\",\"\",'Fiber Device (Desc)'!L10)","v":""},{"$f":"IF('Fiber Device (Desc)'!M10=\"\",\"\",'Fiber Device (Desc)'!M10)","v":""},{"$f":"IF('Fiber Device (Desc)'!N10=\"\",\"\",INDEX([1]FIBER_DEV_MODE!$A$2:$A$100,MATCH('Fiber Device (Desc)'!$N10,[1]!MASTER_FIBER_DEV_MODE_DESC[#Data],0),0))","v":""},{"$f":"IF('Fiber Device (Desc)'!O10=\"\",\"\",'Fiber Device (Desc)'!O10)","v":""},{"$f":"IF('Fiber Device (Desc)'!P10=\"\",\"\",'Fiber Device (Desc)'!P10)","v":""},{"$f":"IF('Fiber Device (Desc)'!Q10=\"\",\"\",'Fiber Device (Desc)'!Q10)","v":""},{"$f":"IF('Fiber Device (Desc)'!R10=\"\",\"\",INDEX([1]FIBER_CONN_TYPE!$A$2:$A$100,MATCH('Fiber Device (Desc)'!$R10,[1]!MASTER_FIBER_CONN_TYPE_DESC[#Data],0),0))","v":""}]
{"$rows_left_out":192}