{"text_format":"1","workbook":"xlsx","n_sheets":2,"sheets":["DC Power Distribution (Desc)","DC Power Distribution (Code)"],"not_rendered":{"charts":0,"images":0,"macros":1,"external_links":1,"defined_names":12,"comments":0,"pivot_tables":0},"unopened":[],"bounds":{"document_bytes":16777216,"sheet_cells":100000,"rows_first":2000,"rows_last":500,"rows_between":2000,"halvings":0,"cell_chars":16384,"cell_head_chars":4096},"cells_cut":0,"cells_raw":0,"read":"whole","date_system":"1900"}

{"sheet":"DC Power Distribution (Desc)","index":0,"n_rows":2,"n_cols":17,"rows_kept":2,"cut":false,"hidden":false,"merged":[]}
["Device Id\nfor update ","Site Identification Name\nEquipment Cabinet SIN","Equipment Location Id ","Previous Name","Installed Date (YYYY/MM/DD)","Manufacturer ","Model ","Serial Number ","NIC Card Installed ","IP Address ","MAC Address ","Battery Pack Installed ","Input Voltage","Output Voltage(s)","Load/Draw (Amp)","Number of Rectifier Positions","Number of Breaker Positions"]
["EQUIP_ID","This Field is for Reference Only\nDO NOT IMPORT","EQUIP_LOC_ID\nREQUIRED FIELD","This Field is for Reference Only\nDO NOT IMPORT","DATE_INSTALLED","ELEC_MANUF_CD ","ELEC_MODEL_CD ","SERIAL_NUMBER","NIC_CARD_IND_CD \nREQUIRED FIELD","IP_ADDRESS","MAC_ADDRESS","BATTERY_PACK_IND_CD\nREQUIRED FIELD","DEV_INPUT_VOLTAGE_CD ","DEV_OUTPUT_VOLTAGE_CD ","DCPDS_LOAD_DRAW ","RECTIFIER _POSITION ","BREAKER_POSITION "]

{"sheet":"DC Power Distribution (Code)","index":1,"n_rows":202,"n_cols":17,"rows_kept":202,"cut":false,"hidden":false,"merged":[]}
["Device Id\nfor update ","Structure Entity Cd","Equipment Location Id ","Installed Date (YYYY/MM/DD)","Manufacturer ","Model ","Serial Number ","NIC Card Installed ","IP Address ","MAC Address ","Battery Pack Installed ","Input Voltage","Output Voltage(s)","Load/Draw (Amp)","Number of Rectifier Positions","Number of Breaker Positions","Electrical Equipment Type"]
["EQUIP_ID","ENTITY_ID      REQUIRED FIELD","EQUIP_LOC_ID  REQUIRED FIELD","DATE_INSTALLED","ELEC_MANUF_CD ","ELEC_MODEL_CD ","SERIAL_NUMBER","NIC_CARD_IND_CD REQUIRED FIELD","IP_ADDRESS","MAC_ADDRESS","BATTERY_PACK_IND_CD REQUIRED FIELD","DEV_INPUT_VOLTAGE_CD ","DEV_OUTPUT_VOLTAGE_CD ","DCPDS_LOAD_DRAW ","RECTIFIER _POSITION ","BREAKER_POSITION ","ELEC_DEV_TYPE_CD"]
[{"$f":"IF('DC Power Distribution (Desc)'!A3=\"\",\"\",'DC Power Distribution (Desc)'!A3)","v":""},{"$f":"IF('DC Power Distribution (Desc)'!C3=\"\",\"\",2029)","v":""},{"$f":"IF('DC Power Distribution (Desc)'!C3=\"\",\"\",'DC Power Distribution (Desc)'!C3)","v":""},{"$f":"IF('DC Power Distribution (Desc)'!E3=\"\",\"\",'DC Power Distribution (Desc)'!E3)","v":""},{"$f":"IF('DC Power Distribution (Desc)'!F3=\"\",\"\",INDEX([1]ELECTRIC_DEV_MANUF!$A$2:$A$1500,MATCH(1,([1]ELECTRIC_DEV_MANUF!$B$2:$B$1500='DC Power Distribution (Desc)'!$F3)*([1]ELECTRIC_DEV_MANUF!$D$2:$D$1500=\"DCPWRDIS\"),0),0))","v":""},{"$f":"IF('DC Power Distribution (Desc)'!G3=\"\",\"\",INDEX([1]ELECTRIC_DEV_MODEL!$A$2:$A$1500,MATCH(1,([1]ELECTRIC_DEV_MODEL!$C$2:$C$1500='DC Power Distribution (Desc)'!$F3)*([1]ELECTRIC_DEV_MODEL!$D$2:$D$1500='DC Power Distribution (Desc)'!$G3)*([1]ELECTRIC_DEV_MODEL!$F$2:$F$1500=\"DCPWRDIS\"),0),0))","v":""},{"$f":"IF('DC Power Distribution (Desc)'!H3=\"\",\"\",'DC Power Distribution (Desc)'!H3)","v":""},{"$f":"IF('DC Power Distribution (Desc)'!I3=\"\",\"\",INDEX([1]YES_NO!$A$2:$A$100,MATCH('DC Power Distribution (Desc)'!$I3,[1]!MASTER_YES_NO_DESC[#Data],0),0))","v":""},{"$f":"IF('DC Power Distribution (Desc)'!J3=\"\",\"\",'DC Power Distribution (Desc)'!J3)","v":""},{"$f":"IF('DC Power Distribution (Desc)'!K3=\"\",\"\",'DC Power Distribution (Desc)'!K3)","v":""},{"$f":"IF('DC Power Distribution (Desc)'!L3=\"\",\"\",INDEX([1]YES_NO!$A$2:$A$100,MATCH('DC Power Distribution (Desc)'!$L3,[1]!MASTER_YES_NO_DESC[#Data],0),0))","v":""},{"$f":"IF('DC Power Distribution (Desc)'!M3=\"\",\"\",INDEX([1]DEV_INPUT_VOLTAGE!$A$2:$A$100,MATCH('DC Power Distribution (Desc)'!$M3,[1]!MASTER_DEV_INPUT_VOLTAGE_DESC[#Data],0),0))","v":""},{"$f":"IF('DC Power Distribution (Desc)'!N3=\"\",\"\",INDEX([1]DEV_OUTPUT_VOLTAGE!$A$2:$A$100,MATCH('DC Power Distribution (Desc)'!$N3,[1]!MASTER_DEV_INPUT_VOLTAGE_DESC[#Data],0),0))","v":""},{"$f":"IF('DC Power Distribution (Desc)'!O3=\"\",\"\",'DC Power Distribution (Desc)'!O3)","v":""},{"$f":"IF('DC Power Distribution (Desc)'!P3=\"\",\"\",'DC Power Distribution (Desc)'!P3)","v":""},{"$f":"IF('DC Power Distribution (Desc)'!Q3=\"\",\"\",'DC Power Distribution (Desc)'!Q3)","v":""},{"$f":"IF('DC Power Distribution (Desc)'!C3=\"\",\"\",\"NA\")","v":""}]
[{"$f":"IF('DC Power Distribution (Desc)'!A4=\"\",\"\",'DC Power Distribution (Desc)'!A4)","v":""},{"$f":"IF('DC Power Distribution (Desc)'!C4=\"\",\"\",2029)","v":""},{"$f":"IF('DC Power Distribution (Desc)'!C4=\"\",\"\",'DC Power Distribution (Desc)'!C4)","v":""},{"$f":"IF('DC Power Distribution (Desc)'!E4=\"\",\"\",'DC Power Distribution (Desc)'!E4)","v":""},{"$f":"IF('DC Power Distribution (Desc)'!F4=\"\",\"\",INDEX([1]ELECTRIC_DEV_MANUF!$A$2:$A$1500,MATCH(1,([1]ELECTRIC_DEV_MANUF!$B$2:$B$1500='DC Power Distribution (Desc)'!$F4)*([1]ELECTRIC_DEV_MANUF!$D$2:$D$1500=\"DCPWRDIS\"),0),0))","v":""},{"$f":"IF('DC Power Distribution (Desc)'!G4=\"\",\"\",INDEX([1]ELECTRIC_DEV_MODEL!$A$2:$A$1500,MATCH(1,([1]ELECTRIC_DEV_MODEL!$C$2:$C$1500='DC Power Distribution (Desc)'!$F4)*([1]ELECTRIC_DEV_MODEL!$D$2:$D$1500='DC Power Distribution (Desc)'!$G4)*([1]ELECTRIC_DEV_MODEL!$F$2:$F$1500=\"DCPWRDIS\"),0),0))","v":""},{"$f":"IF('DC Power Distribution (Desc)'!H4=\"\",\"\",'DC Power Distribution (Desc)'!H4)","v":""},{"$f":"IF('DC Power Distribution (Desc)'!I4=\"\",\"\",INDEX([1]YES_NO!$A$2:$A$100,MATCH('DC Power Distribution (Desc)'!$I4,[1]!MASTER_YES_NO_DESC[#Data],0),0))","v":""},{"$f":"IF('DC Power Distribution (Desc)'!J4=\"\",\"\",'DC Power Distribution (Desc)'!J4)","v":""},{"$f":"IF('DC Power Distribution (Desc)'!K4=\"\",\"\",'DC Power Distribution (Desc)'!K4)","v":""},{"$f":"IF('DC Power Distribution (Desc)'!L4=\"\",\"\",INDEX([1]YES_NO!$A$2:$A$100,MATCH('DC Power Distribution (Desc)'!$L4,[1]!MASTER_YES_NO_DESC[#Data],0),0))","v":""},{"$f":"IF('DC Power Distribution (Desc)'!M4=\"\",\"\",INDEX([1]DEV_INPUT_VOLTAGE!$A$2:$A$100,MATCH('DC Power Distribution (Desc)'!$M4,[1]!MASTER_DEV_INPUT_VOLTAGE_DESC[#Data],0),0))","v":""},{"$f":"IF('DC Power Distribution (Desc)'!N4=\"\",\"\",INDEX([1]DEV_OUTPUT_VOLTAGE!$A$2:$A$100,MATCH('DC Power Distribution (Desc)'!$N4,[1]!MASTER_DEV_INPUT_VOLTAGE_DESC[#Data],0),0))","v":""},{"$f":"IF('DC Power Distribution (Desc)'!O4=\"\",\"\",'DC Power Distribution (Desc)'!O4)","v":""},{"$f":"IF('DC Power Distribution (Desc)'!P4=\"\",\"\",'DC Power Distribution (Desc)'!P4)","v":""},{"$f":"IF('DC Power Distribution (Desc)'!Q4=\"\",\"\",'DC Power Distribution (Desc)'!Q4)","v":""},{"$f":"IF('DC Power Distribution (Desc)'!C4=\"\",\"\",\"NA\")","v":""}]
[{"$f":"IF('DC Power Distribution (Desc)'!A5=\"\",\"\",'DC Power Distribution (Desc)'!A5)","v":""},{"$f":"IF('DC Power Distribution (Desc)'!C5=\"\",\"\",2029)","v":""},{"$f":"IF('DC Power Distribution (Desc)'!C5=\"\",\"\",'DC Power Distribution (Desc)'!C5)","v":""},{"$f":"IF('DC Power Distribution (Desc)'!E5=\"\",\"\",'DC Power Distribution (Desc)'!E5)","v":""},{"$f":"IF('DC Power Distribution (Desc)'!F5=\"\",\"\",INDEX([1]ELECTRIC_DEV_MANUF!$A$2:$A$1500,MATCH(1,([1]ELECTRIC_DEV_MANUF!$B$2:$B$1500='DC Power Distribution (Desc)'!$F5)*([1]ELECTRIC_DEV_MANUF!$D$2:$D$1500=\"DCPWRDIS\"),0),0))","v":""},{"$f":"IF('DC Power Distribution (Desc)'!G5=\"\",\"\",INDEX([1]ELECTRIC_DEV_MODEL!$A$2:$A$1500,MATCH(1,([1]ELECTRIC_DEV_MODEL!$C$2:$C$1500='DC Power Distribution (Desc)'!$F5)*([1]ELECTRIC_DEV_MODEL!$D$2:$D$1500='DC Power Distribution (Desc)'!$G5)*([1]ELECTRIC_DEV_MODEL!$F$2:$F$1500=\"DCPWRDIS\"),0),0))","v":""},{"$f":"IF('DC Power Distribution (Desc)'!H5=\"\",\"\",'DC Power Distribution (Desc)'!H5)","v":""},{"$f":"IF('DC Power Distribution (Desc)'!I5=\"\",\"\",INDEX([1]YES_NO!$A$2:$A$100,MATCH('DC Power Distribution (Desc)'!$I5,[1]!MASTER_YES_NO_DESC[#Data],0),0))","v":""},{"$f":"IF('DC Power Distribution (Desc)'!J5=\"\",\"\",'DC Power Distribution (Desc)'!J5)","v":""},{"$f":"IF('DC Power Distribution (Desc)'!K5=\"\",\"\",'DC Power Distribution (Desc)'!K5)","v":""},{"$f":"IF('DC Power Distribution (Desc)'!L5=\"\",\"\",INDEX([1]YES_NO!$A$2:$A$100,MATCH('DC Power Distribution (Desc)'!$L5,[1]!MASTER_YES_NO_DESC[#Data],0),0))","v":""},{"$f":"IF('DC Power Distribution (Desc)'!M5=\"\",\"\",INDEX([1]DEV_INPUT_VOLTAGE!$A$2:$A$100,MATCH('DC Power Distribution (Desc)'!$M5,[1]!MASTER_DEV_INPUT_VOLTAGE_DESC[#Data],0),0))","v":""},{"$f":"IF('DC Power Distribution (Desc)'!N5=\"\",\"\",INDEX([1]DEV_OUTPUT_VOLTAGE!$A$2:$A$100,MATCH('DC Power Distribution (Desc)'!$N5,[1]!MASTER_DEV_INPUT_VOLTAGE_DESC[#Data],0),0))","v":""},{"$f":"IF('DC Power Distribution (Desc)'!O5=\"\",\"\",'DC Power Distribution (Desc)'!O5)","v":""},{"$f":"IF('DC Power Distribution (Desc)'!P5=\"\",\"\",'DC Power Distribution (Desc)'!P5)","v":""},{"$f":"IF('DC Power Distribution (Desc)'!Q5=\"\",\"\",'DC Power Distribution (Desc)'!Q5)","v":""},{"$f":"IF('DC Power Distribution (Desc)'!C5=\"\",\"\",\"NA\")","v":""}]
[{"$f":"IF('DC Power Distribution (Desc)'!A6=\"\",\"\",'DC Power Distribution (Desc)'!A6)","v":""},{"$f":"IF('DC Power Distribution (Desc)'!C6=\"\",\"\",2029)","v":""},{"$f":"IF('DC Power Distribution (Desc)'!C6=\"\",\"\",'DC Power Distribution (Desc)'!C6)","v":""},{"$f":"IF('DC Power Distribution (Desc)'!E6=\"\",\"\",'DC Power Distribution (Desc)'!E6)","v":""},{"$f":"IF('DC Power Distribution (Desc)'!F6=\"\",\"\",INDEX([1]ELECTRIC_DEV_MANUF!$A$2:$A$1500,MATCH(1,([1]ELECTRIC_DEV_MANUF!$B$2:$B$1500='DC Power Distribution (Desc)'!$F6)*([1]ELECTRIC_DEV_MANUF!$D$2:$D$1500=\"DCPWRDIS\"),0),0))","v":""},{"$f":"IF('DC Power Distribution (Desc)'!G6=\"\",\"\",INDEX([1]ELECTRIC_DEV_MODEL!$A$2:$A$1500,MATCH(1,([1]ELECTRIC_DEV_MODEL!$C$2:$C$1500='DC Power Distribution (Desc)'!$F6)*([1]ELECTRIC_DEV_MODEL!$D$2:$D$1500='DC Power Distribution (Desc)'!$G6)*([1]ELECTRIC_DEV_MODEL!$F$2:$F$1500=\"DCPWRDIS\"),0),0))","v":""},{"$f":"IF('DC Power Distribution (Desc)'!H6=\"\",\"\",'DC Power Distribution (Desc)'!H6)","v":""},{"$f":"IF('DC Power Distribution (Desc)'!I6=\"\",\"\",INDEX([1]YES_NO!$A$2:$A$100,MATCH('DC Power Distribution (Desc)'!$I6,[1]!MASTER_YES_NO_DESC[#Data],0),0))","v":""},{"$f":"IF('DC Power Distribution (Desc)'!J6=\"\",\"\",'DC Power Distribution (Desc)'!J6)","v":""},{"$f":"IF('DC Power Distribution (Desc)'!K6=\"\",\"\",'DC Power Distribution (Desc)'!K6)","v":""},{"$f":"IF('DC Power Distribution (Desc)'!L6=\"\",\"\",INDEX([1]YES_NO!$A$2:$A$100,MATCH('DC Power Distribution (Desc)'!$L6,[1]!MASTER_YES_NO_DESC[#Data],0),0))","v":""},{"$f":"IF('DC Power Distribution (Desc)'!M6=\"\",\"\",INDEX([1]DEV_INPUT_VOLTAGE!$A$2:$A$100,MATCH('DC Power Distribution (Desc)'!$M6,[1]!MASTER_DEV_INPUT_VOLTAGE_DESC[#Data],0),0))","v":""},{"$f":"IF('DC Power Distribution (Desc)'!N6=\"\",\"\",INDEX([1]DEV_OUTPUT_VOLTAGE!$A$2:$A$100,MATCH('DC Power Distribution (Desc)'!$N6,[1]!MASTER_DEV_INPUT_VOLTAGE_DESC[#Data],0),0))","v":""},{"$f":"IF('DC Power Distribution (Desc)'!O6=\"\",\"\",'DC Power Distribution (Desc)'!O6)","v":""},{"$f":"IF('DC Power Distribution (Desc)'!P6=\"\",\"\",'DC Power Distribution (Desc)'!P6)","v":""},{"$f":"IF('DC Power Distribution (Desc)'!Q6=\"\",\"\",'DC Power Distribution (Desc)'!Q6)","v":""},{"$f":"IF('DC Power Distribution (Desc)'!C6=\"\",\"\",\"NA\")","v":""}]
[{"$f":"IF('DC Power Distribution (Desc)'!A7=\"\",\"\",'DC Power Distribution (Desc)'!A7)","v":""},{"$f":"IF('DC Power Distribution (Desc)'!C7=\"\",\"\",2029)","v":""},{"$f":"IF('DC Power Distribution (Desc)'!C7=\"\",\"\",'DC Power Distribution (Desc)'!C7)","v":""},{"$f":"IF('DC Power Distribution (Desc)'!E7=\"\",\"\",'DC Power Distribution (Desc)'!E7)","v":""},{"$f":"IF('DC Power Distribution (Desc)'!F7=\"\",\"\",INDEX([1]ELECTRIC_DEV_MANUF!$A$2:$A$1500,MATCH(1,([1]ELECTRIC_DEV_MANUF!$B$2:$B$1500='DC Power Distribution (Desc)'!$F7)*([1]ELECTRIC_DEV_MANUF!$D$2:$D$1500=\"DCPWRDIS\"),0),0))","v":""},{"$f":"IF('DC Power Distribution (Desc)'!G7=\"\",\"\",INDEX([1]ELECTRIC_DEV_MODEL!$A$2:$A$1500,MATCH(1,([1]ELECTRIC_DEV_MODEL!$C$2:$C$1500='DC Power Distribution (Desc)'!$F7)*([1]ELECTRIC_DEV_MODEL!$D$2:$D$1500='DC Power Distribution (Desc)'!$G7)*([1]ELECTRIC_DEV_MODEL!$F$2:$F$1500=\"DCPWRDIS\"),0),0))","v":""},{"$f":"IF('DC Power Distribution (Desc)'!H7=\"\",\"\",'DC Power Distribution (Desc)'!H7)","v":""},{"$f":"IF('DC Power Distribution (Desc)'!I7=\"\",\"\",INDEX([1]YES_NO!$A$2:$A$100,MATCH('DC Power Distribution (Desc)'!$I7,[1]!MASTER_YES_NO_DESC[#Data],0),0))","v":""},{"$f":"IF('DC Power Distribution (Desc)'!J7=\"\",\"\",'DC Power Distribution (Desc)'!J7)","v":""},{"$f":"IF('DC Power Distribution (Desc)'!K7=\"\",\"\",'DC Power Distribution (Desc)'!K7)","v":""},{"$f":"IF('DC Power Distribution (Desc)'!L7=\"\",\"\",INDEX([1]YES_NO!$A$2:$A$100,MATCH('DC Power Distribution (Desc)'!$L7,[1]!MASTER_YES_NO_DESC[#Data],0),0))","v":""},{"$f":"IF('DC Power Distribution (Desc)'!M7=\"\",\"\",INDEX([1]DEV_INPUT_VOLTAGE!$A$2:$A$100,MATCH('DC Power Distribution (Desc)'!$M7,[1]!MASTER_DEV_INPUT_VOLTAGE_DESC[#Data],0),0))","v":""},{"$f":"IF('DC Power Distribution (Desc)'!N7=\"\",\"\",INDEX([1]DEV_OUTPUT_VOLTAGE!$A$2:$A$100,MATCH('DC Power Distribution (Desc)'!$N7,[1]!MASTER_DEV_INPUT_VOLTAGE_DESC[#Data],0),0))","v":""},{"$f":"IF('DC Power Distribution (Desc)'!O7=\"\",\"\",'DC Power Distribution (Desc)'!O7)","v":""},{"$f":"IF('DC Power Distribution (Desc)'!P7=\"\",\"\",'DC Power Distribution (Desc)'!P7)","v":""},{"$f":"IF('DC Power Distribution (Desc)'!Q7=\"\",\"\",'DC Power Distribution (Desc)'!Q7)","v":""},{"$f":"IF('DC Power Distribution (Desc)'!C7=\"\",\"\",\"NA\")","v":""}]
[{"$f":"IF('DC Power Distribution (Desc)'!A8=\"\",\"\",'DC Power Distribution (Desc)'!A8)","v":""},{"$f":"IF('DC Power Distribution (Desc)'!C8=\"\",\"\",2029)","v":""},{"$f":"IF('DC Power Distribution (Desc)'!C8=\"\",\"\",'DC Power Distribution (Desc)'!C8)","v":""},{"$f":"IF('DC Power Distribution (Desc)'!E8=\"\",\"\",'DC Power Distribution (Desc)'!E8)","v":""},{"$f":"IF('DC Power Distribution (Desc)'!F8=\"\",\"\",INDEX([1]ELECTRIC_DEV_MANUF!$A$2:$A$1500,MATCH(1,([1]ELECTRIC_DEV_MANUF!$B$2:$B$1500='DC Power Distribution (Desc)'!$F8)*([1]ELECTRIC_DEV_MANUF!$D$2:$D$1500=\"DCPWRDIS\"),0),0))","v":""},{"$f":"IF('DC Power Distribution (Desc)'!G8=\"\",\"\",INDEX([1]ELECTRIC_DEV_MODEL!$A$2:$A$1500,MATCH(1,([1]ELECTRIC_DEV_MODEL!$C$2:$C$1500='DC Power Distribution (Desc)'!$F8)*([1]ELECTRIC_DEV_MODEL!$D$2:$D$1500='DC Power Distribution (Desc)'!$G8)*([1]ELECTRIC_DEV_MODEL!$F$2:$F$1500=\"DCPWRDIS\"),0),0))","v":""},{"$f":"IF('DC Power Distribution (Desc)'!H8=\"\",\"\",'DC Power Distribution (Desc)'!H8)","v":""},{"$f":"IF('DC Power Distribution (Desc)'!I8=\"\",\"\",INDEX([1]YES_NO!$A$2:$A$100,MATCH('DC Power Distribution (Desc)'!$I8,[1]!MASTER_YES_NO_DESC[#Data],0),0))","v":""},{"$f":"IF('DC Power Distribution (Desc)'!J8=\"\",\"\",'DC Power Distribution (Desc)'!J8)","v":""},{"$f":"IF('DC Power Distribution (Desc)'!K8=\"\",\"\",'DC Power Distribution (Desc)'!K8)","v":""},{"$f":"IF('DC Power Distribution (Desc)'!L8=\"\",\"\",INDEX([1]YES_NO!$A$2:$A$100,MATCH('DC Power Distribution (Desc)'!$L8,[1]!MASTER_YES_NO_DESC[#Data],0),0))","v":""},{"$f":"IF('DC Power Distribution (Desc)'!M8=\"\",\"\",INDEX([1]DEV_INPUT_VOLTAGE!$A$2:$A$100,MATCH('DC Power Distribution (Desc)'!$M8,[1]!MASTER_DEV_INPUT_VOLTAGE_DESC[#Data],0),0))","v":""},{"$f":"IF('DC Power Distribution (Desc)'!N8=\"\",\"\",INDEX([1]DEV_OUTPUT_VOLTAGE!$A$2:$A$100,MATCH('DC Power Distribution (Desc)'!$N8,[1]!MASTER_DEV_INPUT_VOLTAGE_DESC[#Data],0),0))","v":""},{"$f":"IF('DC Power Distribution (Desc)'!O8=\"\",\"\",'DC Power Distribution (Desc)'!O8)","v":""},{"$f":"IF('DC Power Distribution (Desc)'!P8=\"\",\"\",'DC Power Distribution (Desc)'!P8)","v":""},{"$f":"IF('DC Power Distribution (Desc)'!Q8=\"\",\"\",'DC Power Distribution (Desc)'!Q8)","v":""},{"$f":"IF('DC Power Distribution (Desc)'!C8=\"\",\"\",\"NA\")","v":""}]
[{"$f":"IF('DC Power Distribution (Desc)'!A9=\"\",\"\",'DC Power Distribution (Desc)'!A9)","v":""},{"$f":"IF('DC Power Distribution (Desc)'!C9=\"\",\"\",2029)","v":""},{"$f":"IF('DC Power Distribution (Desc)'!C9=\"\",\"\",'DC Power Distribution (Desc)'!C9)","v":""},{"$f":"IF('DC Power Distribution (Desc)'!E9=\"\",\"\",'DC Power Distribution (Desc)'!E9)","v":""},{"$f":"IF('DC Power Distribution (Desc)'!F9=\"\",\"\",INDEX([1]ELECTRIC_DEV_MANUF!$A$2:$A$1500,MATCH(1,([1]ELECTRIC_DEV_MANUF!$B$2:$B$1500='DC Power Distribution (Desc)'!$F9)*([1]ELECTRIC_DEV_MANUF!$D$2:$D$1500=\"DCPWRDIS\"),0),0))","v":""},{"$f":"IF('DC Power Distribution (Desc)'!G9=\"\",\"\",INDEX([1]ELECTRIC_DEV_MODEL!$A$2:$A$1500,MATCH(1,([1]ELECTRIC_DEV_MODEL!$C$2:$C$1500='DC Power Distribution (Desc)'!$F9)*([1]ELECTRIC_DEV_MODEL!$D$2:$D$1500='DC Power Distribution (Desc)'!$G9)*([1]ELECTRIC_DEV_MODEL!$F$2:$F$1500=\"DCPWRDIS\"),0),0))","v":""},{"$f":"IF('DC Power Distribution (Desc)'!H9=\"\",\"\",'DC Power Distribution (Desc)'!H9)","v":""},{"$f":"IF('DC Power Distribution (Desc)'!I9=\"\",\"\",INDEX([1]YES_NO!$A$2:$A$100,MATCH('DC Power Distribution (Desc)'!$I9,[1]!MASTER_YES_NO_DESC[#Data],0),0))","v":""},{"$f":"IF('DC Power Distribution (Desc)'!J9=\"\",\"\",'DC Power Distribution (Desc)'!J9)","v":""},{"$f":"IF('DC Power Distribution (Desc)'!K9=\"\",\"\",'DC Power Distribution (Desc)'!K9)","v":""},{"$f":"IF('DC Power Distribution (Desc)'!L9=\"\",\"\",INDEX([1]YES_NO!$A$2:$A$100,MATCH('DC Power Distribution (Desc)'!$L9,[1]!MASTER_YES_NO_DESC[#Data],0),0))","v":""},{"$f":"IF('DC Power Distribution (Desc)'!M9=\"\",\"\",INDEX([1]DEV_INPUT_VOLTAGE!$A$2:$A$100,MATCH('DC Power Distribution (Desc)'!$M9,[1]!MASTER_DEV_INPUT_VOLTAGE_DESC[#Data],0),0))","v":""},{"$f":"IF('DC Power Distribution (Desc)'!N9=\"\",\"\",INDEX([1]DEV_OUTPUT_VOLTAGE!$A$2:$A$100,MATCH('DC Power Distribution (Desc)'!$N9,[1]!MASTER_DEV_INPUT_VOLTAGE_DESC[#Data],0),0))","v":""},{"$f":"IF('DC Power Distribution (Desc)'!O9=\"\",\"\",'DC Power Distribution (Desc)'!O9)","v":""},{"$f":"IF('DC Power Distribution (Desc)'!P9=\"\",\"\",'DC Power Distribution (Desc)'!P9)","v":""},{"$f":"IF('DC Power Distribution (Desc)'!Q9=\"\",\"\",'DC Power Distribution (Desc)'!Q9)","v":""},{"$f":"IF('DC Power Distribution (Desc)'!C9=\"\",\"\",\"NA\")","v":""}]
[{"$f":"IF('DC Power Distribution (Desc)'!A10=\"\",\"\",'DC Power Distribution (Desc)'!A10)","v":""},{"$f":"IF('DC Power Distribution (Desc)'!C10=\"\",\"\",2029)","v":""},{"$f":"IF('DC Power Distribution (Desc)'!C10=\"\",\"\",'DC Power Distribution (Desc)'!C10)","v":""},{"$f":"IF('DC Power Distribution (Desc)'!E10=\"\",\"\",'DC Power Distribution (Desc)'!E10)","v":""},{"$f":"IF('DC Power Distribution (Desc)'!F10=\"\",\"\",INDEX([1]ELECTRIC_DEV_MANUF!$A$2:$A$1500,MATCH(1,([1]ELECTRIC_DEV_MANUF!$B$2:$B$1500='DC Power Distribution (Desc)'!$F10)*([1]ELECTRIC_DEV_MANUF!$D$2:$D$1500=\"DCPWRDIS\"),0),0))","v":""},{"$f":"IF('DC Power Distribution (Desc)'!G10=\"\",\"\",INDEX([1]ELECTRIC_DEV_MODEL!$A$2:$A$1500,MATCH(1,([1]ELECTRIC_DEV_MODEL!$C$2:$C$1500='DC Power Distribution (Desc)'!$F10)*([1]ELECTRIC_DEV_MODEL!$D$2:$D$1500='DC Power Distribution (Desc)'!$G10)*([1]ELECTRIC_DEV_MODEL!$F$2:$F$1500=\"DCPWRDIS\"),0),0))","v":""},{"$f":"IF('DC Power Distribution (Desc)'!H10=\"\",\"\",'DC Power Distribution (Desc)'!H10)","v":""},{"$f":"IF('DC Power Distribution (Desc)'!I10=\"\",\"\",INDEX([1]YES_NO!$A$2:$A$100,MATCH('DC Power Distribution (Desc)'!$I10,[1]!MASTER_YES_NO_DESC[#Data],0),0))","v":""},{"$f":"IF('DC Power Distribution (Desc)'!J10=\"\",\"\",'DC Power Distribution (Desc)'!J10)","v":""},{"$f":"IF('DC Power Distribution (Desc)'!K10=\"\",\"\",'DC Power Distribution (Desc)'!K10)","v":""},{"$f":"IF('DC Power Distribution (Desc)'!L10=\"\",\"\",INDEX([1]YES_NO!$A$2:$A$100,MATCH('DC Power Distribution (Desc)'!$L10,[1]!MASTER_YES_NO_DESC[#Data],0),0))","v":""},{"$f":"IF('DC Power Distribution (Desc)'!M10=\"\",\"\",INDEX([1]DEV_INPUT_VOLTAGE!$A$2:$A$100,MATCH('DC Power Distribution (Desc)'!$M10,[1]!MASTER_DEV_INPUT_VOLTAGE_DESC[#Data],0),0))","v":""},{"$f":"IF('DC Power Distribution (Desc)'!N10=\"\",\"\",INDEX([1]DEV_OUTPUT_VOLTAGE!$A$2:$A$100,MATCH('DC Power Distribution (Desc)'!$N10,[1]!MASTER_DEV_INPUT_VOLTAGE_DESC[#Data],0),0))","v":""},{"$f":"IF('DC Power Distribution (Desc)'!O10=\"\",\"\",'DC Power Distribution (Desc)'!O10)","v":""},{"$f":"IF('DC Power Distribution (Desc)'!P10=\"\",\"\",'DC Power Distribution (Desc)'!P10)","v":""},{"$f":"IF('DC Power Distribution (Desc)'!Q10=\"\",\"\",'DC Power Distribution (Desc)'!Q10)","v":""},{"$f":"IF('DC Power Distribution (Desc)'!C10=\"\",\"\",\"NA\")","v":""}]
{"$rows_left_out":192}