{"text_format":"1","workbook":"xlsx","n_sheets":4,"sheets":["AVI (Desc)","AVI (Code)","AVI Antenna (Desc)","AVI Antenna (Code)"],"not_rendered":{"charts":0,"images":0,"macros":1,"external_links":1,"defined_names":15,"comments":4,"pivot_tables":0},"unopened":[],"bounds":{"document_bytes":16777216,"sheet_cells":100000,"rows_first":2000,"rows_last":500,"rows_between":2000,"halvings":0,"cell_chars":16384,"cell_head_chars":4096},"cells_cut":0,"cells_raw":0,"read":"whole","date_system":"1900"}

{"sheet":"AVI (Desc)","index":0,"n_rows":2,"n_cols":10,"rows_kept":2,"cut":false,"hidden":false,"merged":[]}
["Site Identification Name","Device Name","Asset ID Number","Asset ID Source","Longitude","Latitude","Facility Owner","County","Installed Date (YYYY/MM/DD)","Sensor Type"]
["SITE_NO\nREQUIRED FIELD","NAME\nREQUIRED FIELD","ASSET_ID","ASSET_ID_SOURCE","PRIM GEOM (X)\nREQUIRED FIELD","PRIM GEOM (Y)\nREQUIRED FIELD","OWNER_CD\nREQUIRED FIELD","COUNTY_CD\nREQUIRED FIELD","DATE_INSTALLED","AVI_SENSOR_TYPE_CD\n"]

{"sheet":"AVI (Code)","index":1,"n_rows":202,"n_cols":10,"rows_kept":202,"cut":false,"hidden":false,"merged":[]}
["Site Identification Name","Device Name","Asset ID Number","Asset ID Source","Latitude ","Longitude","Facility Owner","County","Installed Date (YYYY/MM/DD)","Sensor Type"]
["SITE_NO                            REQUIRED FIELD","NAME                       REQUIRED FIELD","ASSET_ID","ASSET_ID_SOURCE","PRIM GEOM (X) REQUIRED FIELD","PRIM GEOM (Y) REQUIRED FIELD","OWNER_CD REQUIRED FIELD","COUNTY_CD REQUIRED FIELD","DATE_INSTALLED","AVI_SENSOR_TYPE_CD"]
[{"$f":"IF('AVI (Desc)'!A3=\"\",\"\",'AVI (Desc)'!A3)","v":""},{"$f":"IF('AVI (Desc)'!B3=\"\",\"\",'AVI (Desc)'!B3)","v":""},{"$f":"IF('AVI (Desc)'!C3=\"\",\"\",'AVI (Desc)'!C3)","v":""},{"$f":"IF('AVI (Desc)'!D3=\"\",\"\",INDEX([1]ASSET_ID_SOURCE!$A$2:$A$50,MATCH('AVI (Desc)'!D3,[1]!MASTER_ASSET_ID_SOURCE_DESC,0),0))","v":""},{"$f":"IF('AVI (Desc)'!E3=\"\",\"\",'AVI (Desc)'!E3)","v":""},{"$f":"IF('AVI (Desc)'!F3=\"\",\"\",'AVI (Desc)'!F3)","v":""},{"$f":"IF('AVI (Desc)'!G3=\"\",\"\",INDEX([1]OWNER!$A$2:$A$100,MATCH('AVI (Desc)'!$G3,[1]!MASTER_OWNER_DESC[#Data],0),0))","v":""},{"$f":"IF('AVI (Desc)'!H3=\"\",\"\",INDEX([1]COUNTY!$A$2:$A$80,MATCH('AVI (Desc)'!H3,[1]!MASTER_COUNTY_NAME[#Data],0),0))","v":""},{"$f":"IF('AVI (Desc)'!I3=\"\",\"\",'AVI (Desc)'!I3)","v":""},{"$f":"IF('AVI (Desc)'!J3=\"\",\"\",INDEX([1]AVI_SENSOR_TYPE!$A$2:$A$7,MATCH('AVI (Desc)'!J3,[1]!MASTER_AVI_SENSOR_TYPE_DESC,0),0))","v":""}]
[{"$f":"IF('AVI (Desc)'!A4=\"\",\"\",'AVI (Desc)'!A4)","v":""},{"$f":"IF('AVI (Desc)'!B4=\"\",\"\",'AVI (Desc)'!B4)","v":""},{"$f":"IF('AVI (Desc)'!C4=\"\",\"\",'AVI (Desc)'!C4)","v":""},{"$f":"IF('AVI (Desc)'!D4=\"\",\"\",INDEX([1]ASSET_ID_SOURCE!$A$2:$A$50,MATCH('AVI (Desc)'!D4,[1]!MASTER_ASSET_ID_SOURCE_DESC,0),0))","v":""},{"$f":"IF('AVI (Desc)'!E4=\"\",\"\",'AVI (Desc)'!E4)","v":""},{"$f":"IF('AVI (Desc)'!F4=\"\",\"\",'AVI (Desc)'!F4)","v":""},{"$f":"IF('AVI (Desc)'!G4=\"\",\"\",INDEX([1]OWNER!$A$2:$A$100,MATCH('AVI (Desc)'!$G4,[1]!MASTER_OWNER_DESC[#Data],0),0))","v":""},{"$f":"IF('AVI (Desc)'!H4=\"\",\"\",INDEX([1]COUNTY!$A$2:$A$80,MATCH('AVI (Desc)'!H4,[1]!MASTER_COUNTY_NAME[#Data],0),0))","v":""},{"$f":"IF('AVI (Desc)'!I4=\"\",\"\",'AVI (Desc)'!I4)","v":""},{"$f":"IF('AVI (Desc)'!J4=\"\",\"\",INDEX([1]AVI_SENSOR_TYPE!$A$2:$A$7,MATCH('AVI (Desc)'!J4,[1]!MASTER_AVI_SENSOR_TYPE_DESC,0),0))","v":""}]
[{"$f":"IF('AVI (Desc)'!A5=\"\",\"\",'AVI (Desc)'!A5)","v":""},{"$f":"IF('AVI (Desc)'!B5=\"\",\"\",'AVI (Desc)'!B5)","v":""},{"$f":"IF('AVI (Desc)'!C5=\"\",\"\",'AVI (Desc)'!C5)","v":""},{"$f":"IF('AVI (Desc)'!D5=\"\",\"\",INDEX([1]ASSET_ID_SOURCE!$A$2:$A$50,MATCH('AVI (Desc)'!D5,[1]!MASTER_ASSET_ID_SOURCE_DESC,0),0))","v":""},{"$f":"IF('AVI (Desc)'!E5=\"\",\"\",'AVI (Desc)'!E5)","v":""},{"$f":"IF('AVI (Desc)'!F5=\"\",\"\",'AVI (Desc)'!F5)","v":""},{"$f":"IF('AVI (Desc)'!G5=\"\",\"\",INDEX([1]OWNER!$A$2:$A$100,MATCH('AVI (Desc)'!$G5,[1]!MASTER_OWNER_DESC[#Data],0),0))","v":""},{"$f":"IF('AVI (Desc)'!H5=\"\",\"\",INDEX([1]COUNTY!$A$2:$A$80,MATCH('AVI (Desc)'!H5,[1]!MASTER_COUNTY_NAME[#Data],0),0))","v":""},{"$f":"IF('AVI (Desc)'!I5=\"\",\"\",'AVI (Desc)'!I5)","v":""},{"$f":"IF('AVI (Desc)'!J5=\"\",\"\",INDEX([1]AVI_SENSOR_TYPE!$A$2:$A$7,MATCH('AVI (Desc)'!J5,[1]!MASTER_AVI_SENSOR_TYPE_DESC,0),0))","v":""}]
[{"$f":"IF('AVI (Desc)'!A6=\"\",\"\",'AVI (Desc)'!A6)","v":""},{"$f":"IF('AVI (Desc)'!B6=\"\",\"\",'AVI (Desc)'!B6)","v":""},{"$f":"IF('AVI (Desc)'!C6=\"\",\"\",'AVI (Desc)'!C6)","v":""},{"$f":"IF('AVI (Desc)'!D6=\"\",\"\",INDEX([1]ASSET_ID_SOURCE!$A$2:$A$50,MATCH('AVI (Desc)'!D6,[1]!MASTER_ASSET_ID_SOURCE_DESC,0),0))","v":""},{"$f":"IF('AVI (Desc)'!E6=\"\",\"\",'AVI (Desc)'!E6)","v":""},{"$f":"IF('AVI (Desc)'!F6=\"\",\"\",'AVI (Desc)'!F6)","v":""},{"$f":"IF('AVI (Desc)'!G6=\"\",\"\",INDEX([1]OWNER!$A$2:$A$100,MATCH('AVI (Desc)'!$G6,[1]!MASTER_OWNER_DESC[#Data],0),0))","v":""},{"$f":"IF('AVI (Desc)'!H6=\"\",\"\",INDEX([1]COUNTY!$A$2:$A$80,MATCH('AVI (Desc)'!H6,[1]!MASTER_COUNTY_NAME[#Data],0),0))","v":""},{"$f":"IF('AVI (Desc)'!I6=\"\",\"\",'AVI (Desc)'!I6)","v":""},{"$f":"IF('AVI (Desc)'!J6=\"\",\"\",INDEX([1]AVI_SENSOR_TYPE!$A$2:$A$7,MATCH('AVI (Desc)'!J6,[1]!MASTER_AVI_SENSOR_TYPE_DESC,0),0))","v":""}]
[{"$f":"IF('AVI (Desc)'!A7=\"\",\"\",'AVI (Desc)'!A7)","v":""},{"$f":"IF('AVI (Desc)'!B7=\"\",\"\",'AVI (Desc)'!B7)","v":""},{"$f":"IF('AVI (Desc)'!C7=\"\",\"\",'AVI (Desc)'!C7)","v":""},{"$f":"IF('AVI (Desc)'!D7=\"\",\"\",INDEX([1]ASSET_ID_SOURCE!$A$2:$A$50,MATCH('AVI (Desc)'!D7,[1]!MASTER_ASSET_ID_SOURCE_DESC,0),0))","v":""},{"$f":"IF('AVI (Desc)'!E7=\"\",\"\",'AVI (Desc)'!E7)","v":""},{"$f":"IF('AVI (Desc)'!F7=\"\",\"\",'AVI (Desc)'!F7)","v":""},{"$f":"IF('AVI (Desc)'!G7=\"\",\"\",INDEX([1]OWNER!$A$2:$A$100,MATCH('AVI (Desc)'!$G7,[1]!MASTER_OWNER_DESC[#Data],0),0))","v":""},{"$f":"IF('AVI (Desc)'!H7=\"\",\"\",INDEX([1]COUNTY!$A$2:$A$80,MATCH('AVI (Desc)'!H7,[1]!MASTER_COUNTY_NAME[#Data],0),0))","v":""},{"$f":"IF('AVI (Desc)'!I7=\"\",\"\",'AVI (Desc)'!I7)","v":""},{"$f":"IF('AVI (Desc)'!J7=\"\",\"\",INDEX([1]AVI_SENSOR_TYPE!$A$2:$A$7,MATCH('AVI (Desc)'!J7,[1]!MASTER_AVI_SENSOR_TYPE_DESC,0),0))","v":""}]
[{"$f":"IF('AVI (Desc)'!A8=\"\",\"\",'AVI (Desc)'!A8)","v":""},{"$f":"IF('AVI (Desc)'!B8=\"\",\"\",'AVI (Desc)'!B8)","v":""},{"$f":"IF('AVI (Desc)'!C8=\"\",\"\",'AVI (Desc)'!C8)","v":""},{"$f":"IF('AVI (Desc)'!D8=\"\",\"\",INDEX([1]ASSET_ID_SOURCE!$A$2:$A$50,MATCH('AVI (Desc)'!D8,[1]!MASTER_ASSET_ID_SOURCE_DESC,0),0))","v":""},{"$f":"IF('AVI (Desc)'!E8=\"\",\"\",'AVI (Desc)'!E8)","v":""},{"$f":"IF('AVI (Desc)'!F8=\"\",\"\",'AVI (Desc)'!F8)","v":""},{"$f":"IF('AVI (Desc)'!G8=\"\",\"\",INDEX([1]OWNER!$A$2:$A$100,MATCH('AVI (Desc)'!$G8,[1]!MASTER_OWNER_DESC[#Data],0),0))","v":""},{"$f":"IF('AVI (Desc)'!H8=\"\",\"\",INDEX([1]COUNTY!$A$2:$A$80,MATCH('AVI (Desc)'!H8,[1]!MASTER_COUNTY_NAME[#Data],0),0))","v":""},{"$f":"IF('AVI (Desc)'!I8=\"\",\"\",'AVI (Desc)'!I8)","v":""},{"$f":"IF('AVI (Desc)'!J8=\"\",\"\",INDEX([1]AVI_SENSOR_TYPE!$A$2:$A$7,MATCH('AVI (Desc)'!J8,[1]!MASTER_AVI_SENSOR_TYPE_DESC,0),0))","v":""}]
[{"$f":"IF('AVI (Desc)'!A9=\"\",\"\",'AVI (Desc)'!A9)","v":""},{"$f":"IF('AVI (Desc)'!B9=\"\",\"\",'AVI (Desc)'!B9)","v":""},{"$f":"IF('AVI (Desc)'!C9=\"\",\"\",'AVI (Desc)'!C9)","v":""},{"$f":"IF('AVI (Desc)'!D9=\"\",\"\",INDEX([1]ASSET_ID_SOURCE!$A$2:$A$50,MATCH('AVI (Desc)'!D9,[1]!MASTER_ASSET_ID_SOURCE_DESC,0),0))","v":""},{"$f":"IF('AVI (Desc)'!E9=\"\",\"\",'AVI (Desc)'!E9)","v":""},{"$f":"IF('AVI (Desc)'!F9=\"\",\"\",'AVI (Desc)'!F9)","v":""},{"$f":"IF('AVI (Desc)'!G9=\"\",\"\",INDEX([1]OWNER!$A$2:$A$100,MATCH('AVI (Desc)'!$G9,[1]!MASTER_OWNER_DESC[#Data],0),0))","v":""},{"$f":"IF('AVI (Desc)'!H9=\"\",\"\",INDEX([1]COUNTY!$A$2:$A$80,MATCH('AVI (Desc)'!H9,[1]!MASTER_COUNTY_NAME[#Data],0),0))","v":""},{"$f":"IF('AVI (Desc)'!I9=\"\",\"\",'AVI (Desc)'!I9)","v":""},{"$f":"IF('AVI (Desc)'!J9=\"\",\"\",INDEX([1]AVI_SENSOR_TYPE!$A$2:$A$7,MATCH('AVI (Desc)'!J9,[1]!MASTER_AVI_SENSOR_TYPE_DESC,0),0))","v":""}]
[{"$f":"IF('AVI (Desc)'!A10=\"\",\"\",'AVI (Desc)'!A10)","v":""},{"$f":"IF('AVI (Desc)'!B10=\"\",\"\",'AVI (Desc)'!B10)","v":""},{"$f":"IF('AVI (Desc)'!C10=\"\",\"\",'AVI (Desc)'!C10)","v":""},{"$f":"IF('AVI (Desc)'!D10=\"\",\"\",INDEX([1]ASSET_ID_SOURCE!$A$2:$A$50,MATCH('AVI (Desc)'!D10,[1]!MASTER_ASSET_ID_SOURCE_DESC,0),0))","v":""},{"$f":"IF('AVI (Desc)'!E10=\"\",\"\",'AVI (Desc)'!E10)","v":""},{"$f":"IF('AVI (Desc)'!F10=\"\",\"\",'AVI (Desc)'!F10)","v":""},{"$f":"IF('AVI (Desc)'!G10=\"\",\"\",INDEX([1]OWNER!$A$2:$A$100,MATCH('AVI (Desc)'!$G10,[1]!MASTER_OWNER_DESC[#Data],0),0))","v":""},{"$f":"IF('AVI (Desc)'!H10=\"\",\"\",INDEX([1]COUNTY!$A$2:$A$80,MATCH('AVI (Desc)'!H10,[1]!MASTER_COUNTY_NAME[#Data],0),0))","v":""},{"$f":"IF('AVI (Desc)'!I10=\"\",\"\",'AVI (Desc)'!I10)","v":""},{"$f":"IF('AVI (Desc)'!J10=\"\",\"\",INDEX([1]AVI_SENSOR_TYPE!$A$2:$A$7,MATCH('AVI (Desc)'!J10,[1]!MASTER_AVI_SENSOR_TYPE_DESC,0),0))","v":""}]
{"$rows_left_out":193}
{"sheet":"AVI Antenna (Desc)","index":2,"n_rows":2,"n_cols":10,"rows_kept":2,"cut":false,"hidden":false,"merged":[]}
["Site Identification Name\nController/Reader Cabinet SIN","Device ID","Asset ID Number","Asset ID Source","Associated Controller/Reader","Antenna Type ","Manufacturer ","Model ","Travel Lane Number ","Travel Lane Direction "]
["This Field is for Reference Only\nDO NOT IMPORT","EQUIP_LOC_ID\nREQUIRED FIELD","ASSET_ID","ASSET_ID_SOURCE","ASSOC_READER_ID","ANTENNA_TYPE_CD ","ANTENNA_MANUF_CD ","ANTENNA _MODEL_CD ","LANE_COVERAGE_CD ","LANE_DIRECTION_CD "]

{"sheet":"AVI Antenna (Code)","index":3,"n_rows":202,"n_cols":10,"rows_kept":202,"cut":false,"hidden":false,"merged":[]}
["Parent ITS Device Entity Cd","Device ID","Asset ID Number","Asset ID Source","Associated Controller/Reader","Antenna Type ","Manufacturer","Model ","Travel Lane Number ","Travel Lane Direction "]
["ENTITY_CD                   REQUIRED FIELD","EQUIP_LOC_ID            REQUIRED FIELD","ASSET_ID","ASSET_ID_SOURCE","ASSOC_READER_ID","ANTENNA_TYPE_CD ","ANTENNA_MANUF_CD ","ANTENNA _MODEL_CD ","LANE_COVERAGE_CD ","LANE_DIRECTION_CD "]
[{"$f":"IF('AVI Antenna (Desc)'!B3=\"\",\"\",\"2007\")","v":""},{"$f":"IF('AVI Antenna (Desc)'!E3=\"\",\"\",'AVI Antenna (Desc)'!B3)","v":""},{"$f":"IF('AVI Antenna (Desc)'!C3=\"\",\"\",'AVI Antenna (Desc)'!C3)","v":""},{"$f":"IF('AVI Antenna (Desc)'!D3=\"\",\"\",INDEX([1]ASSET_ID_SOURCE!$A$2:$A$50,MATCH('AVI Antenna (Desc)'!D3,[1]!MASTER_ASSET_ID_SOURCE_DESC,0),0))","v":""},{"$f":"IF('AVI Antenna (Desc)'!F3=\"\",\"\",'AVI Antenna (Desc)'!E3)","v":""},{"$f":"IF('AVI Antenna (Desc)'!F3=\"\",\"\",INDEX([1]ANTENNA_TYPE!$A$2:$A$100,MATCH('AVI Antenna (Desc)'!$F3,[1]!MASTER_ANTENNA_TYPE_DESC[#Data],0),0))","v":""},{"$f":"IF('AVI Antenna (Desc)'!G3=\"\",\"\",INDEX([1]ANTENNA_MANUF!$A$2:$A$100,MATCH('AVI Antenna (Desc)'!$G3,[1]!MASTER_ANTENNA_MANUF_DESC[#Data],0),0))","v":""},{"$f":"IF('AVI Antenna (Desc)'!H3=\"\",\"\",INDEX([1]ANTENNA_MODEL!$A$2:$A$50,MATCH(1,([1]ANTENNA_MODEL!$C$2:$C$50='AVI Antenna (Desc)'!$G3)*([1]ANTENNA_MODEL!$D$2:$D$50='AVI Antenna (Desc)'!$H3),0),0))","v":""},{"$f":"IF('AVI Antenna (Desc)'!I3=\"\",\"\",INDEX([1]LANE_COVERAGE!$A$2:$A$100,MATCH('AVI Antenna (Desc)'!$I3,[1]!MASTER_LANE_COVERAGE_DESC[#Data],0),0))","v":""},{"$f":"IF('AVI Antenna (Desc)'!J3=\"\",\"\",INDEX([1]LANE_DIRECTION!$A$2:$A$100,MATCH('AVI Antenna (Desc)'!$J3,[1]!MASTER_LANE_DIRECTION_DESC[#Data],0),0))","v":""}]
[{"$f":"IF('AVI Antenna (Desc)'!B4=\"\",\"\",\"2007\")","v":""},{"$f":"IF('AVI Antenna (Desc)'!E4=\"\",\"\",'AVI Antenna (Desc)'!B4)","v":""},{"$f":"IF('AVI Antenna (Desc)'!C4=\"\",\"\",'AVI Antenna (Desc)'!C4)","v":""},{"$f":"IF('AVI Antenna (Desc)'!D4=\"\",\"\",INDEX([1]ASSET_ID_SOURCE!$A$2:$A$50,MATCH('AVI Antenna (Desc)'!D4,[1]!MASTER_ASSET_ID_SOURCE_DESC,0),0))","v":""},{"$f":"IF('AVI Antenna (Desc)'!F4=\"\",\"\",'AVI Antenna (Desc)'!E4)","v":""},{"$f":"IF('AVI Antenna (Desc)'!F4=\"\",\"\",INDEX([1]ANTENNA_TYPE!$A$2:$A$100,MATCH('AVI Antenna (Desc)'!$F4,[1]!MASTER_ANTENNA_TYPE_DESC[#Data],0),0))","v":""},{"$f":"IF('AVI Antenna (Desc)'!G4=\"\",\"\",INDEX([1]ANTENNA_MANUF!$A$2:$A$100,MATCH('AVI Antenna (Desc)'!$G4,[1]!MASTER_ANTENNA_MANUF_DESC[#Data],0),0))","v":""},{"$f":"IF('AVI Antenna (Desc)'!H4=\"\",\"\",INDEX([1]ANTENNA_MODEL!$A$2:$A$50,MATCH(1,([1]ANTENNA_MODEL!$C$2:$C$50='AVI Antenna (Desc)'!$G4)*([1]ANTENNA_MODEL!$D$2:$D$50='AVI Antenna (Desc)'!$H4),0),0))","v":""},{"$f":"IF('AVI Antenna (Desc)'!I4=\"\",\"\",INDEX([1]LANE_COVERAGE!$A$2:$A$100,MATCH('AVI Antenna (Desc)'!$I4,[1]!MASTER_LANE_COVERAGE_DESC[#Data],0),0))","v":""},{"$f":"IF('AVI Antenna (Desc)'!J4=\"\",\"\",INDEX([1]LANE_DIRECTION!$A$2:$A$100,MATCH('AVI Antenna (Desc)'!$J4,[1]!MASTER_LANE_DIRECTION_DESC[#Data],0),0))","v":""}]
[{"$f":"IF('AVI Antenna (Desc)'!B5=\"\",\"\",\"2007\")","v":""},{"$f":"IF('AVI Antenna (Desc)'!E5=\"\",\"\",'AVI Antenna (Desc)'!B5)","v":""},{"$f":"IF('AVI Antenna (Desc)'!C5=\"\",\"\",'AVI Antenna (Desc)'!C5)","v":""},{"$f":"IF('AVI Antenna (Desc)'!D5=\"\",\"\",INDEX([1]ASSET_ID_SOURCE!$A$2:$A$50,MATCH('AVI Antenna (Desc)'!D5,[1]!MASTER_ASSET_ID_SOURCE_DESC,0),0))","v":""},{"$f":"IF('AVI Antenna (Desc)'!F5=\"\",\"\",'AVI Antenna (Desc)'!E5)","v":""},{"$f":"IF('AVI Antenna (Desc)'!F5=\"\",\"\",INDEX([1]ANTENNA_TYPE!$A$2:$A$100,MATCH('AVI Antenna (Desc)'!$F5,[1]!MASTER_ANTENNA_TYPE_DESC[#Data],0),0))","v":""},{"$f":"IF('AVI Antenna (Desc)'!G5=\"\",\"\",INDEX([1]ANTENNA_MANUF!$A$2:$A$100,MATCH('AVI Antenna (Desc)'!$G5,[1]!MASTER_ANTENNA_MANUF_DESC[#Data],0),0))","v":""},{"$f":"IF('AVI Antenna (Desc)'!H5=\"\",\"\",INDEX([1]ANTENNA_MODEL!$A$2:$A$50,MATCH(1,([1]ANTENNA_MODEL!$C$2:$C$50='AVI Antenna (Desc)'!$G5)*([1]ANTENNA_MODEL!$D$2:$D$50='AVI Antenna (Desc)'!$H5),0),0))","v":""},{"$f":"IF('AVI Antenna (Desc)'!I5=\"\",\"\",INDEX([1]LANE_COVERAGE!$A$2:$A$100,MATCH('AVI Antenna (Desc)'!$I5,[1]!MASTER_LANE_COVERAGE_DESC[#Data],0),0))","v":""},{"$f":"IF('AVI Antenna (Desc)'!J5=\"\",\"\",INDEX([1]LANE_DIRECTION!$A$2:$A$100,MATCH('AVI Antenna (Desc)'!$J5,[1]!MASTER_LANE_DIRECTION_DESC[#Data],0),0))","v":""}]
[{"$f":"IF('AVI Antenna (Desc)'!B6=\"\",\"\",\"2007\")","v":""},{"$f":"IF('AVI Antenna (Desc)'!E6=\"\",\"\",'AVI Antenna (Desc)'!B6)","v":""},{"$f":"IF('AVI Antenna (Desc)'!C6=\"\",\"\",'AVI Antenna (Desc)'!C6)","v":""},{"$f":"IF('AVI Antenna (Desc)'!D6=\"\",\"\",INDEX([1]ASSET_ID_SOURCE!$A$2:$A$50,MATCH('AVI Antenna (Desc)'!D6,[1]!MASTER_ASSET_ID_SOURCE_DESC,0),0))","v":""},{"$f":"IF('AVI Antenna (Desc)'!F6=\"\",\"\",'AVI Antenna (Desc)'!E6)","v":""},{"$f":"IF('AVI Antenna (Desc)'!F6=\"\",\"\",INDEX([1]ANTENNA_TYPE!$A$2:$A$100,MATCH('AVI Antenna (Desc)'!$F6,[1]!MASTER_ANTENNA_TYPE_DESC[#Data],0),0))","v":""},{"$f":"IF('AVI Antenna (Desc)'!G6=\"\",\"\",INDEX([1]ANTENNA_MANUF!$A$2:$A$100,MATCH('AVI Antenna (Desc)'!$G6,[1]!MASTER_ANTENNA_MANUF_DESC[#Data],0),0))","v":""},{"$f":"IF('AVI Antenna (Desc)'!H6=\"\",\"\",INDEX([1]ANTENNA_MODEL!$A$2:$A$50,MATCH(1,([1]ANTENNA_MODEL!$C$2:$C$50='AVI Antenna (Desc)'!$G6)*([1]ANTENNA_MODEL!$D$2:$D$50='AVI Antenna (Desc)'!$H6),0),0))","v":""},{"$f":"IF('AVI Antenna (Desc)'!I6=\"\",\"\",INDEX([1]LANE_COVERAGE!$A$2:$A$100,MATCH('AVI Antenna (Desc)'!$I6,[1]!MASTER_LANE_COVERAGE_DESC[#Data],0),0))","v":""},{"$f":"IF('AVI Antenna (Desc)'!J6=\"\",\"\",INDEX([1]LANE_DIRECTION!$A$2:$A$100,MATCH('AVI Antenna (Desc)'!$J6,[1]!MASTER_LANE_DIRECTION_DESC[#Data],0),0))","v":""}]
[{"$f":"IF('AVI Antenna (Desc)'!B7=\"\",\"\",\"2007\")","v":""},{"$f":"IF('AVI Antenna (Desc)'!E7=\"\",\"\",'AVI Antenna (Desc)'!B7)","v":""},{"$f":"IF('AVI Antenna (Desc)'!C7=\"\",\"\",'AVI Antenna (Desc)'!C7)","v":""},{"$f":"IF('AVI Antenna (Desc)'!D7=\"\",\"\",INDEX([1]ASSET_ID_SOURCE!$A$2:$A$50,MATCH('AVI Antenna (Desc)'!D7,[1]!MASTER_ASSET_ID_SOURCE_DESC,0),0))","v":""},{"$f":"IF('AVI Antenna (Desc)'!F7=\"\",\"\",'AVI Antenna (Desc)'!E7)","v":""},{"$f":"IF('AVI Antenna (Desc)'!F7=\"\",\"\",INDEX([1]ANTENNA_TYPE!$A$2:$A$100,MATCH('AVI Antenna (Desc)'!$F7,[1]!MASTER_ANTENNA_TYPE_DESC[#Data],0),0))","v":""},{"$f":"IF('AVI Antenna (Desc)'!G7=\"\",\"\",INDEX([1]ANTENNA_MANUF!$A$2:$A$100,MATCH('AVI Antenna (Desc)'!$G7,[1]!MASTER_ANTENNA_MANUF_DESC[#Data],0),0))","v":""},{"$f":"IF('AVI Antenna (Desc)'!H7=\"\",\"\",INDEX([1]ANTENNA_MODEL!$A$2:$A$50,MATCH(1,([1]ANTENNA_MODEL!$C$2:$C$50='AVI Antenna (Desc)'!$G7)*([1]ANTENNA_MODEL!$D$2:$D$50='AVI Antenna (Desc)'!$H7),0),0))","v":""},{"$f":"IF('AVI Antenna (Desc)'!I7=\"\",\"\",INDEX([1]LANE_COVERAGE!$A$2:$A$100,MATCH('AVI Antenna (Desc)'!$I7,[1]!MASTER_LANE_COVERAGE_DESC[#Data],0),0))","v":""},{"$f":"IF('AVI Antenna (Desc)'!J7=\"\",\"\",INDEX([1]LANE_DIRECTION!$A$2:$A$100,MATCH('AVI Antenna (Desc)'!$J7,[1]!MASTER_LANE_DIRECTION_DESC[#Data],0),0))","v":""}]
[{"$f":"IF('AVI Antenna (Desc)'!B8=\"\",\"\",\"2007\")","v":""},{"$f":"IF('AVI Antenna (Desc)'!E8=\"\",\"\",'AVI Antenna (Desc)'!B8)","v":""},{"$f":"IF('AVI Antenna (Desc)'!C8=\"\",\"\",'AVI Antenna (Desc)'!C8)","v":""},{"$f":"IF('AVI Antenna (Desc)'!D8=\"\",\"\",INDEX([1]ASSET_ID_SOURCE!$A$2:$A$50,MATCH('AVI Antenna (Desc)'!D8,[1]!MASTER_ASSET_ID_SOURCE_DESC,0),0))","v":""},{"$f":"IF('AVI Antenna (Desc)'!F8=\"\",\"\",'AVI Antenna (Desc)'!E8)","v":""},{"$f":"IF('AVI Antenna (Desc)'!F8=\"\",\"\",INDEX([1]ANTENNA_TYPE!$A$2:$A$100,MATCH('AVI Antenna (Desc)'!$F8,[1]!MASTER_ANTENNA_TYPE_DESC[#Data],0),0))","v":""},{"$f":"IF('AVI Antenna (Desc)'!G8=\"\",\"\",INDEX([1]ANTENNA_MANUF!$A$2:$A$100,MATCH('AVI Antenna (Desc)'!$G8,[1]!MASTER_ANTENNA_MANUF_DESC[#Data],0),0))","v":""},{"$f":"IF('AVI Antenna (Desc)'!H8=\"\",\"\",INDEX([1]ANTENNA_MODEL!$A$2:$A$50,MATCH(1,([1]ANTENNA_MODEL!$C$2:$C$50='AVI Antenna (Desc)'!$G8)*([1]ANTENNA_MODEL!$D$2:$D$50='AVI Antenna (Desc)'!$H8),0),0))","v":""},{"$f":"IF('AVI Antenna (Desc)'!I8=\"\",\"\",INDEX([1]LANE_COVERAGE!$A$2:$A$100,MATCH('AVI Antenna (Desc)'!$I8,[1]!MASTER_LANE_COVERAGE_DESC[#Data],0),0))","v":""},{"$f":"IF('AVI Antenna (Desc)'!J8=\"\",\"\",INDEX([1]LANE_DIRECTION!$A$2:$A$100,MATCH('AVI Antenna (Desc)'!$J8,[1]!MASTER_LANE_DIRECTION_DESC[#Data],0),0))","v":""}]
[{"$f":"IF('AVI Antenna (Desc)'!B9=\"\",\"\",\"2007\")","v":""},{"$f":"IF('AVI Antenna (Desc)'!E9=\"\",\"\",'AVI Antenna (Desc)'!B9)","v":""},{"$f":"IF('AVI Antenna (Desc)'!C9=\"\",\"\",'AVI Antenna (Desc)'!C9)","v":""},{"$f":"IF('AVI Antenna (Desc)'!D9=\"\",\"\",INDEX([1]ASSET_ID_SOURCE!$A$2:$A$50,MATCH('AVI Antenna (Desc)'!D9,[1]!MASTER_ASSET_ID_SOURCE_DESC,0),0))","v":""},{"$f":"IF('AVI Antenna (Desc)'!F9=\"\",\"\",'AVI Antenna (Desc)'!E9)","v":""},{"$f":"IF('AVI Antenna (Desc)'!F9=\"\",\"\",INDEX([1]ANTENNA_TYPE!$A$2:$A$100,MATCH('AVI Antenna (Desc)'!$F9,[1]!MASTER_ANTENNA_TYPE_DESC[#Data],0),0))","v":""},{"$f":"IF('AVI Antenna (Desc)'!G9=\"\",\"\",INDEX([1]ANTENNA_MANUF!$A$2:$A$100,MATCH('AVI Antenna (Desc)'!$G9,[1]!MASTER_ANTENNA_MANUF_DESC[#Data],0),0))","v":""},{"$f":"IF('AVI Antenna (Desc)'!H9=\"\",\"\",INDEX([1]ANTENNA_MODEL!$A$2:$A$50,MATCH(1,([1]ANTENNA_MODEL!$C$2:$C$50='AVI Antenna (Desc)'!$G9)*([1]ANTENNA_MODEL!$D$2:$D$50='AVI Antenna (Desc)'!$H9),0),0))","v":""},{"$f":"IF('AVI Antenna (Desc)'!I9=\"\",\"\",INDEX([1]LANE_COVERAGE!$A$2:$A$100,MATCH('AVI Antenna (Desc)'!$I9,[1]!MASTER_LANE_COVERAGE_DESC[#Data],0),0))","v":""},{"$f":"IF('AVI Antenna (Desc)'!J9=\"\",\"\",INDEX([1]LANE_DIRECTION!$A$2:$A$100,MATCH('AVI Antenna (Desc)'!$J9,[1]!MASTER_LANE_DIRECTION_DESC[#Data],0),0))","v":""}]
[{"$f":"IF('AVI Antenna (Desc)'!B10=\"\",\"\",\"2007\")","v":""},{"$f":"IF('AVI Antenna (Desc)'!E10=\"\",\"\",'AVI Antenna (Desc)'!B10)","v":""},{"$f":"IF('AVI Antenna (Desc)'!C10=\"\",\"\",'AVI Antenna (Desc)'!C10)","v":""},{"$f":"IF('AVI Antenna (Desc)'!D10=\"\",\"\",INDEX([1]ASSET_ID_SOURCE!$A$2:$A$50,MATCH('AVI Antenna (Desc)'!D10,[1]!MASTER_ASSET_ID_SOURCE_DESC,0),0))","v":""},{"$f":"IF('AVI Antenna (Desc)'!F10=\"\",\"\",'AVI Antenna (Desc)'!E10)","v":""},{"$f":"IF('AVI Antenna (Desc)'!F10=\"\",\"\",INDEX([1]ANTENNA_TYPE!$A$2:$A$100,MATCH('AVI Antenna (Desc)'!$F10,[1]!MASTER_ANTENNA_TYPE_DESC[#Data],0),0))","v":""},{"$f":"IF('AVI Antenna (Desc)'!G10=\"\",\"\",INDEX([1]ANTENNA_MANUF!$A$2:$A$100,MATCH('AVI Antenna (Desc)'!$G10,[1]!MASTER_ANTENNA_MANUF_DESC[#Data],0),0))","v":""},{"$f":"IF('AVI Antenna (Desc)'!H10=\"\",\"\",INDEX([1]ANTENNA_MODEL!$A$2:$A$50,MATCH(1,([1]ANTENNA_MODEL!$C$2:$C$50='AVI Antenna (Desc)'!$G10)*([1]ANTENNA_MODEL!$D$2:$D$50='AVI Antenna (Desc)'!$H10),0),0))","v":""},{"$f":"IF('AVI Antenna (Desc)'!I10=\"\",\"\",INDEX([1]LANE_COVERAGE!$A$2:$A$100,MATCH('AVI Antenna (Desc)'!$I10,[1]!MASTER_LANE_COVERAGE_DESC[#Data],0),0))","v":""},{"$f":"IF('AVI Antenna (Desc)'!J10=\"\",\"\",INDEX([1]LANE_DIRECTION!$A$2:$A$100,MATCH('AVI Antenna (Desc)'!$J10,[1]!MASTER_LANE_DIRECTION_DESC[#Data],0),0))","v":""}]
{"$rows_left_out":192}