{"text_format":"1","workbook":"xlsx","n_sheets":4,"sheets":["TMC (Desc)","TMC (Code)","Communication Facility (Desc)","Communication Facility (Code)"],"not_rendered":{"charts":0,"images":0,"macros":1,"external_links":1,"defined_names":15,"comments":0,"pivot_tables":0},"unopened":[],"bounds":{"document_bytes":16777216,"sheet_cells":100000,"rows_first":2000,"rows_last":500,"rows_between":2000,"halvings":0,"cell_chars":16384,"cell_head_chars":4096},"cells_cut":0,"cells_raw":0,"read":"whole","date_system":"1900"}

{"sheet":"TMC (Desc)","index":0,"n_rows":2,"n_cols":8,"rows_kept":2,"cut":false,"hidden":false,"merged":[]}
["Device Id\nfor update ","Site Identification Name\nTMC or Other Control Center SIN","Latitude","Longitude","Facility Owner","County","Installed Date (YYYY)","NAME"]
["EQUIP_ID","SITE_NO\nREQUIRED FIELD","PRIM GEOM (Y)\nREQUIRED FIELD","PRIM GEOM (X)\nREQUIRED FIELD","OWNER_CD\nREQUIRED FIELD","COUNTY_CD\nREQUIRED FIELD","YEAR_INSTALLED","RTMC Name\nREQUIRED FIELD"]

{"sheet":"TMC (Code)","index":1,"n_rows":42,"n_cols":8,"rows_kept":42,"cut":false,"hidden":false,"merged":[]}
["Device Id\nfor update ","Site Identification Name\nTMC or Other Control Center SIN","Latitude ","Longitude","Facility Owner","County","Installed Date (YYYY)","NAME"]
["EQUIP_ID","SITE_NO\nREQUIRED FIELD","PRIM GEOM (Y)   REQUIRED FIELD","PRIM GEOM (X)   REQUIRED FIELD","OWNER_CD     REQUIRED FIELD","COUNTY_CD     REQUIRED FIELD","YEAR_INSTALLED","RTMC Name\nREQUIRED FIELD"]
[{"$f":"IF('TMC (Desc)'!A3=\"\",\"\",'TMC (Desc)'!A3)","v":""},{"$f":"IF('TMC (Desc)'!B3=\"\",\"\",'TMC (Desc)'!B3)","v":""},{"$f":"IF('TMC (Desc)'!C3=\"\",\"\",'TMC (Desc)'!C3)","v":""},{"$f":"IF('TMC (Desc)'!D3=\"\",\"\",'TMC (Desc)'!D3)","v":""},{"$f":"IF('TMC (Desc)'!E3=\"\",\"\",INDEX([1]OWNER!$A$2:$A$100,MATCH('TMC (Desc)'!$E3,[1]!MASTER_OWNER_DESC[#Data],0),0))","v":""},{"$f":"IF('TMC (Desc)'!F3=\"\",\"\",INDEX([1]COUNTY!$A$2:$A$80,MATCH('TMC (Desc)'!F3,[1]!MASTER_COUNTY_NAME[#Data],0),0))","v":""},{"$f":"IF('TMC (Desc)'!G3=\"\",\"\",'TMC (Desc)'!G3)","v":""},{"$f":"IF('TMC (Desc)'!H3=\"\",\"\",'TMC (Desc)'!H3)","v":""}]
[{"$f":"IF('TMC (Desc)'!A4=\"\",\"\",'TMC (Desc)'!A4)","v":""},{"$f":"IF('TMC (Desc)'!B4=\"\",\"\",'TMC (Desc)'!B4)","v":""},{"$f":"IF('TMC (Desc)'!C4=\"\",\"\",'TMC (Desc)'!C4)","v":""},{"$f":"IF('TMC (Desc)'!D4=\"\",\"\",'TMC (Desc)'!D4)","v":""},{"$f":"IF('TMC (Desc)'!E4=\"\",\"\",INDEX([1]OWNER!$A$2:$A$100,MATCH('TMC (Desc)'!$E4,[1]!MASTER_OWNER_DESC[#Data],0),0))","v":""},{"$f":"IF('TMC (Desc)'!F4=\"\",\"\",INDEX([1]COUNTY!$A$2:$A$80,MATCH('TMC (Desc)'!F4,[1]!MASTER_COUNTY_NAME[#Data],0),0))","v":""},{"$f":"IF('TMC (Desc)'!G4=\"\",\"\",'TMC (Desc)'!G4)","v":""},{"$f":"IF('TMC (Desc)'!H4=\"\",\"\",'TMC (Desc)'!H4)","v":""}]
[{"$f":"IF('TMC (Desc)'!A5=\"\",\"\",'TMC (Desc)'!A5)","v":""},{"$f":"IF('TMC (Desc)'!B5=\"\",\"\",'TMC (Desc)'!B5)","v":""},{"$f":"IF('TMC (Desc)'!C5=\"\",\"\",'TMC (Desc)'!C5)","v":""},{"$f":"IF('TMC (Desc)'!D5=\"\",\"\",'TMC (Desc)'!D5)","v":""},{"$f":"IF('TMC (Desc)'!E5=\"\",\"\",INDEX([1]OWNER!$A$2:$A$100,MATCH('TMC (Desc)'!$E5,[1]!MASTER_OWNER_DESC[#Data],0),0))","v":""},{"$f":"IF('TMC (Desc)'!F5=\"\",\"\",INDEX([1]COUNTY!$A$2:$A$80,MATCH('TMC (Desc)'!F5,[1]!MASTER_COUNTY_NAME[#Data],0),0))","v":""},{"$f":"IF('TMC (Desc)'!G5=\"\",\"\",'TMC (Desc)'!G5)","v":""},{"$f":"IF('TMC (Desc)'!H5=\"\",\"\",'TMC (Desc)'!H5)","v":""}]
[{"$f":"IF('TMC (Desc)'!A6=\"\",\"\",'TMC (Desc)'!A6)","v":""},{"$f":"IF('TMC (Desc)'!B6=\"\",\"\",'TMC (Desc)'!B6)","v":""},{"$f":"IF('TMC (Desc)'!C6=\"\",\"\",'TMC (Desc)'!C6)","v":""},{"$f":"IF('TMC (Desc)'!D6=\"\",\"\",'TMC (Desc)'!D6)","v":""},{"$f":"IF('TMC (Desc)'!E6=\"\",\"\",INDEX([1]OWNER!$A$2:$A$100,MATCH('TMC (Desc)'!$E6,[1]!MASTER_OWNER_DESC[#Data],0),0))","v":""},{"$f":"IF('TMC (Desc)'!F6=\"\",\"\",INDEX([1]COUNTY!$A$2:$A$80,MATCH('TMC (Desc)'!F6,[1]!MASTER_COUNTY_NAME[#Data],0),0))","v":""},{"$f":"IF('TMC (Desc)'!G6=\"\",\"\",'TMC (Desc)'!G6)","v":""},{"$f":"IF('TMC (Desc)'!H6=\"\",\"\",'TMC (Desc)'!H6)","v":""}]
{"$rows_left_out":37}
{"sheet":"Communication Facility (Desc)","index":2,"n_rows":2,"n_cols":23,"rows_kept":2,"cut":false,"hidden":false,"merged":[]}
["Device Id\nfor update ","Site Identification Name\nCommunication Facility Equipment Site SIN","Latitude ","Longitude","Facility Type","Facility Owner","County","Installed Date (YYYY)","Facility Name","Property Identification No.","Cabinet Type","Cabinet Mount Type","Sun Shield Installed","Building Type","Building Dimensions \n(L x W x H)","Building Material","Key Type","# of Filters","Filter Type","Filter Dimensions \n(L x W)","Distance to Travel Lane (Ft.)","Located in Clear Zone (Yes/No)","Lane Closure Req’d\n(Yes/No)"]
["EQUIP_ID","SITE_NO\nREQUIRED FIELD","PRIM GEOM (Y)\nREQUIRED FIELD","PRIM GEOM (X)\nREQUIRED FIELD","FACILITY_TYPE_CD\nREQUIRE FIELD","OWNER_CD\nREQUIRED FIELD","COUNTY_CD\nREQUIRED FIELD","YEAR_INSTALLED","NAME\nREQUIRED FIELD","PROPERTY_ID ","CABINET_TYPE_CD","CABINET_MOUNT_TYPE_CD","SUNSHIELD_CD","BUILDING_TYPE_CD","BUILDING_DIMENSION","BUILDING_MTL_CD","KEY_TYPE_CD","NUM_OF_FILTERS","FILTER_TYPE_CD","FILTER_SIZE_CD","DISTANCE_TO_EOTL","CLEAR_ZONE_IND_CD ","LANE_CLOSURE_IND_CD "]

{"sheet":"Communication Facility (Code)","index":3,"n_rows":127,"n_cols":23,"rows_kept":127,"cut":false,"hidden":false,"merged":[]}
["Device Id\nfor update ","Site Identification Name Communication Facility Equipment Site SIN","Latitude ","Longitude","Facility Type","Facility Owner","County","Installed Date (YYYY)","Facility Name","Property Identification No.","Cabinet Type","Cabinet Mount Type","Sun Shield Installed","Building Type","Building Dimensions         (L x W x H)","Building Material","Key Type","# of Filters","Filter Type","Filter   Dimensions     (L x W)","Distance to Travel Lane (Ft.)","Located in Clear Zone (Yes/No)","Lane Closure Req’d (Yes/No)"]
["EQUIP_ID","SITE_NO\nREQUIRED FIELD","PRIM GEOM (Y) REQUIRED FIELD","PRIM GEOM (X) REQUIRED FIELD","FACILITY_TYPE_CD REQUIRE FIELD","OWNER_CD REQUIRED FIELD","COUNTY_CD REQUIRED FIELD","YEAR_INSTALLED","NAME","PROPERTY_ID","CABINET_TYPE_CD","CABINET_MOUNT_TYPE_CD","SUNSHIELD_CD","BUILDING_TYPE_CD","BUILDING_DIMENSION","BUILDING_MTL_CD","KEY_TYPE_CD","NUM_OF_FILTERS","FILTER_TYPE_CD","FILTER_SIZE_CD","DISTANCE_TO_EOTL","CLEAR_ZONE_IND_CD","LANE_CLOSURE_IND_CD"]
[{"$f":"IF('Communication Facility (Desc)'!A3=\"\",\"\",'Communication Facility (Desc)'!A3)","v":""},{"$f":"IF('Communication Facility (Desc)'!B3=\"\",\"\",'Communication Facility (Desc)'!B3)","v":""},{"$f":"IF('Communication Facility (Desc)'!C3=\"\",\"\",'Communication Facility (Desc)'!C3)","v":""},{"$f":"IF('Communication Facility (Desc)'!D3=\"\",\"\",'Communication Facility (Desc)'!D3)","v":""},{"$f":"IF('Communication Facility (Desc)'!E3=\"\",\"\",INDEX([1]FACILITY_TYPE!$A$2:$A$100,MATCH('Communication Facility (Desc)'!$E3,[1]!MASTER_FACILITY_TYPE_DESC[#Data],0),0))","v":""},{"$f":"IF('Communication Facility (Desc)'!F3=\"\",\"\",INDEX([1]OWNER!$A$2:$A$100,MATCH('Communication Facility (Desc)'!$F3,[1]!MASTER_OWNER_DESC[#Data],0),0))","v":""},{"$f":"IF('Communication Facility (Desc)'!G3=\"\",\"\",IF('Communication Facility (Desc)'!G3=\"\",\"\",INDEX([1]COUNTY!$A$2:$A$80,MATCH('Communication Facility (Desc)'!G3,[1]!MASTER_COUNTY_NAME[#Data],0),0)))","v":""},{"$f":"IF('Communication Facility (Desc)'!H3=\"\",\"\",'Communication Facility (Desc)'!H3)","v":""},{"$f":"IF('Communication Facility (Desc)'!I3=\"\",\"\",'Communication Facility (Desc)'!I3)","v":""},{"$f":"IF('Communication Facility (Desc)'!J3=\"\",\"\",'Communication Facility (Desc)'!J3)","v":""},{"$f":"IF('Communication Facility (Desc)'!K3=\"\",\"\",INDEX([1]CABINET_TYPE!$A$2:$A$100,MATCH('Communication Facility (Desc)'!$K3,[1]!MASTER_CABINET_TYPE_DESC[#Data],0),0))","v":""},{"$f":"IF('Communication Facility (Desc)'!L3=\"\",\"\",INDEX([1]CABINET_MOUNT_TYPE!$A$2:$A$100,MATCH('Communication Facility (Desc)'!L3,[1]!MASTER_CABINET_MOUNT_TYPE_DESC[#Data],0),0))","v":""},{"$f":"IF('Communication Facility (Desc)'!M3=\"\",\"\",INDEX([1]YES_NO!$A$2:$A$100,MATCH('Communication Facility (Desc)'!M3,[1]!MASTER_YES_NO_DESC[#Data],0),0))","v":""},{"$f":"IF('Communication Facility (Desc)'!N3=\"\",\"\",INDEX([1]BUILDING_TYPE!$A$2:$A$100,MATCH('Communication Facility (Desc)'!$N3,[1]!MASTER_BUILDING_TYPE_DESC[#Data],0),0))","v":""},{"$f":"IF('Communication Facility (Desc)'!O3=\"\",\"\",'Communication Facility (Desc)'!O3)","v":""},{"$f":"IF('Communication Facility (Desc)'!P3=\"\",\"\",INDEX([1]BUILDING_MTL!$A$2:$A$100,MATCH('Communication Facility (Desc)'!$P3,[1]!MASTER_BUILDING_MTL_DESC[#Data],0),0))","v":""},{"$f":"IF('Communication Facility (Desc)'!Q3=\"\",\"\",INDEX([1]KEY_TYPE!$A$2:$A$100,MATCH('Communication Facility (Desc)'!$Q3,[1]!MASTER_KEY_TYPE_DESC[#Data],0),0))","v":""},{"$f":"IF('Communication Facility (Desc)'!R3=\"\",\"\",'Communication Facility (Desc)'!R3)","v":""},{"$f":"IF('Communication Facility (Desc)'!S3=\"\",\"\",INDEX([1]FILTER_TYPE!$A$2:$A$100,MATCH('Communication Facility (Desc)'!$S3,[1]!MASTER_FILTER_TYPE_DESC[#Data],0),0))","v":""},{"$f":"IF('Communication Facility (Desc)'!T3=\"\",\"\",INDEX([1]FILTER_SIZE!$A$2:$A$100,MATCH('Communication Facility (Desc)'!$T3,[1]!MASTER_FILTER_SIZE_DESC[#Data],0),0))","v":""},{"$f":"IF('Communication Facility (Desc)'!U3=\"\",\"\",'Communication Facility (Desc)'!U3)","v":""},{"$f":"IF('Communication Facility (Desc)'!V3=\"\",\"\",INDEX([1]YES_NO!$A$2:$A$100,MATCH('Communication Facility (Desc)'!$V3,[1]!MASTER_YES_NO_DESC[#Data],0),0))","v":""},{"$f":"IF('Communication Facility (Desc)'!W3=\"\",\"\",INDEX([1]YES_NO!$A$2:$A$100,MATCH('Communication Facility (Desc)'!$W3,[1]!MASTER_YES_NO_DESC[#Data],0),0))","v":""}]
[{"$f":"IF('Communication Facility (Desc)'!A4=\"\",\"\",'Communication Facility (Desc)'!A4)","v":""},{"$f":"IF('Communication Facility (Desc)'!B4=\"\",\"\",'Communication Facility (Desc)'!B4)","v":""},{"$f":"IF('Communication Facility (Desc)'!C4=\"\",\"\",'Communication Facility (Desc)'!C4)","v":""},{"$f":"IF('Communication Facility (Desc)'!D4=\"\",\"\",'Communication Facility (Desc)'!D4)","v":""},{"$f":"IF('Communication Facility (Desc)'!E4=\"\",\"\",INDEX([1]FACILITY_TYPE!$A$2:$A$100,MATCH('Communication Facility (Desc)'!$E4,[1]!MASTER_FACILITY_TYPE_DESC[#Data],0),0))","v":""},{"$f":"IF('Communication Facility (Desc)'!F4=\"\",\"\",INDEX([1]OWNER!$A$2:$A$100,MATCH('Communication Facility (Desc)'!$F4,[1]!MASTER_OWNER_DESC[#Data],0),0))","v":""},{"$f":"IF('Communication Facility (Desc)'!G4=\"\",\"\",IF('Communication Facility (Desc)'!G4=\"\",\"\",INDEX([1]COUNTY!$A$2:$A$80,MATCH('Communication Facility (Desc)'!G4,[1]!MASTER_COUNTY_NAME[#Data],0),0)))","v":""},{"$f":"IF('Communication Facility (Desc)'!H4=\"\",\"\",'Communication Facility (Desc)'!H4)","v":""},{"$f":"IF('Communication Facility (Desc)'!I4=\"\",\"\",'Communication Facility (Desc)'!I4)","v":""},{"$f":"IF('Communication Facility (Desc)'!J4=\"\",\"\",'Communication Facility (Desc)'!J4)","v":""},{"$f":"IF('Communication Facility (Desc)'!K4=\"\",\"\",INDEX([1]CABINET_TYPE!$A$2:$A$100,MATCH('Communication Facility (Desc)'!$K4,[1]!MASTER_CABINET_TYPE_DESC[#Data],0),0))","v":""},{"$f":"IF('Communication Facility (Desc)'!L4=\"\",\"\",INDEX([1]CABINET_MOUNT_TYPE!$A$2:$A$100,MATCH('Communication Facility (Desc)'!L4,[1]!MASTER_CABINET_MOUNT_TYPE_DESC[#Data],0),0))","v":""},{"$f":"IF('Communication Facility (Desc)'!M4=\"\",\"\",INDEX([1]YES_NO!$A$2:$A$100,MATCH('Communication Facility (Desc)'!M4,[1]!MASTER_YES_NO_DESC[#Data],0),0))","v":""},{"$f":"IF('Communication Facility (Desc)'!N4=\"\",\"\",INDEX([1]BUILDING_TYPE!$A$2:$A$100,MATCH('Communication Facility (Desc)'!$N4,[1]!MASTER_BUILDING_TYPE_DESC[#Data],0),0))","v":""},{"$f":"IF('Communication Facility (Desc)'!O4=\"\",\"\",'Communication Facility (Desc)'!O4)","v":""},{"$f":"IF('Communication Facility (Desc)'!P4=\"\",\"\",INDEX([1]BUILDING_MTL!$A$2:$A$100,MATCH('Communication Facility (Desc)'!$P4,[1]!MASTER_BUILDING_MTL_DESC[#Data],0),0))","v":""},{"$f":"IF('Communication Facility (Desc)'!Q4=\"\",\"\",INDEX([1]KEY_TYPE!$A$2:$A$100,MATCH('Communication Facility (Desc)'!$Q4,[1]!MASTER_KEY_TYPE_DESC[#Data],0),0))","v":""},{"$f":"IF('Communication Facility (Desc)'!R4=\"\",\"\",'Communication Facility (Desc)'!R4)","v":""},{"$f":"IF('Communication Facility (Desc)'!S4=\"\",\"\",INDEX([1]FILTER_TYPE!$A$2:$A$100,MATCH('Communication Facility (Desc)'!$S4,[1]!MASTER_FILTER_TYPE_DESC[#Data],0),0))","v":""},{"$f":"IF('Communication Facility (Desc)'!T4=\"\",\"\",INDEX([1]FILTER_SIZE!$A$2:$A$100,MATCH('Communication Facility (Desc)'!$T4,[1]!MASTER_FILTER_SIZE_DESC[#Data],0),0))","v":""},{"$f":"IF('Communication Facility (Desc)'!U4=\"\",\"\",'Communication Facility (Desc)'!U4)","v":""},{"$f":"IF('Communication Facility (Desc)'!V4=\"\",\"\",INDEX([1]YES_NO!$A$2:$A$100,MATCH('Communication Facility (Desc)'!$V4,[1]!MASTER_YES_NO_DESC[#Data],0),0))","v":""},{"$f":"IF('Communication Facility (Desc)'!W4=\"\",\"\",INDEX([1]YES_NO!$A$2:$A$100,MATCH('Communication Facility (Desc)'!$W4,[1]!MASTER_YES_NO_DESC[#Data],0),0))","v":""}]
[{"$f":"IF('Communication Facility (Desc)'!A5=\"\",\"\",'Communication Facility (Desc)'!A5)","v":""},{"$f":"IF('Communication Facility (Desc)'!B5=\"\",\"\",'Communication Facility (Desc)'!B5)","v":""},{"$f":"IF('Communication Facility (Desc)'!C5=\"\",\"\",'Communication Facility (Desc)'!C5)","v":""},{"$f":"IF('Communication Facility (Desc)'!D5=\"\",\"\",'Communication Facility (Desc)'!D5)","v":""},{"$f":"IF('Communication Facility (Desc)'!E5=\"\",\"\",INDEX([1]FACILITY_TYPE!$A$2:$A$100,MATCH('Communication Facility (Desc)'!$E5,[1]!MASTER_FACILITY_TYPE_DESC[#Data],0),0))","v":""},{"$f":"IF('Communication Facility (Desc)'!F5=\"\",\"\",INDEX([1]OWNER!$A$2:$A$100,MATCH('Communication Facility (Desc)'!$F5,[1]!MASTER_OWNER_DESC[#Data],0),0))","v":""},{"$f":"IF('Communication Facility (Desc)'!G5=\"\",\"\",IF('Communication Facility (Desc)'!G5=\"\",\"\",INDEX([1]COUNTY!$A$2:$A$80,MATCH('Communication Facility (Desc)'!G5,[1]!MASTER_COUNTY_NAME[#Data],0),0)))","v":""},{"$f":"IF('Communication Facility (Desc)'!H5=\"\",\"\",'Communication Facility (Desc)'!H5)","v":""},{"$f":"IF('Communication Facility (Desc)'!I5=\"\",\"\",'Communication Facility (Desc)'!I5)","v":""},{"$f":"IF('Communication Facility (Desc)'!J5=\"\",\"\",'Communication Facility (Desc)'!J5)","v":""},{"$f":"IF('Communication Facility (Desc)'!K5=\"\",\"\",INDEX([1]CABINET_TYPE!$A$2:$A$100,MATCH('Communication Facility (Desc)'!$K5,[1]!MASTER_CABINET_TYPE_DESC[#Data],0),0))","v":""},{"$f":"IF('Communication Facility (Desc)'!L5=\"\",\"\",INDEX([1]CABINET_MOUNT_TYPE!$A$2:$A$100,MATCH('Communication Facility (Desc)'!L5,[1]!MASTER_CABINET_MOUNT_TYPE_DESC[#Data],0),0))","v":""},{"$f":"IF('Communication Facility (Desc)'!M5=\"\",\"\",INDEX([1]YES_NO!$A$2:$A$100,MATCH('Communication Facility (Desc)'!M5,[1]!MASTER_YES_NO_DESC[#Data],0),0))","v":""},{"$f":"IF('Communication Facility (Desc)'!N5=\"\",\"\",INDEX([1]BUILDING_TYPE!$A$2:$A$100,MATCH('Communication Facility (Desc)'!$N5,[1]!MASTER_BUILDING_TYPE_DESC[#Data],0),0))","v":""},{"$f":"IF('Communication Facility (Desc)'!O5=\"\",\"\",'Communication Facility (Desc)'!O5)","v":""},{"$f":"IF('Communication Facility (Desc)'!P5=\"\",\"\",INDEX([1]BUILDING_MTL!$A$2:$A$100,MATCH('Communication Facility (Desc)'!$P5,[1]!MASTER_BUILDING_MTL_DESC[#Data],0),0))","v":""},{"$f":"IF('Communication Facility (Desc)'!Q5=\"\",\"\",INDEX([1]KEY_TYPE!$A$2:$A$100,MATCH('Communication Facility (Desc)'!$Q5,[1]!MASTER_KEY_TYPE_DESC[#Data],0),0))","v":""},{"$f":"IF('Communication Facility (Desc)'!R5=\"\",\"\",'Communication Facility (Desc)'!R5)","v":""},{"$f":"IF('Communication Facility (Desc)'!S5=\"\",\"\",INDEX([1]FILTER_TYPE!$A$2:$A$100,MATCH('Communication Facility (Desc)'!$S5,[1]!MASTER_FILTER_TYPE_DESC[#Data],0),0))","v":""},{"$f":"IF('Communication Facility (Desc)'!T5=\"\",\"\",INDEX([1]FILTER_SIZE!$A$2:$A$100,MATCH('Communication Facility (Desc)'!$T5,[1]!MASTER_FILTER_SIZE_DESC[#Data],0),0))","v":""},{"$f":"IF('Communication Facility (Desc)'!U5=\"\",\"\",'Communication Facility (Desc)'!U5)","v":""},{"$f":"IF('Communication Facility (Desc)'!V5=\"\",\"\",INDEX([1]YES_NO!$A$2:$A$100,MATCH('Communication Facility (Desc)'!$V5,[1]!MASTER_YES_NO_DESC[#Data],0),0))","v":""},{"$f":"IF('Communication Facility (Desc)'!W5=\"\",\"\",INDEX([1]YES_NO!$A$2:$A$100,MATCH('Communication Facility (Desc)'!$W5,[1]!MASTER_YES_NO_DESC[#Data],0),0))","v":""}]
[{"$f":"IF('Communication Facility (Desc)'!A6=\"\",\"\",'Communication Facility (Desc)'!A6)","v":""},{"$f":"IF('Communication Facility (Desc)'!B6=\"\",\"\",'Communication Facility (Desc)'!B6)","v":""},{"$f":"IF('Communication Facility (Desc)'!C6=\"\",\"\",'Communication Facility (Desc)'!C6)","v":""},{"$f":"IF('Communication Facility (Desc)'!D6=\"\",\"\",'Communication Facility (Desc)'!D6)","v":""},{"$f":"IF('Communication Facility (Desc)'!E6=\"\",\"\",INDEX([1]FACILITY_TYPE!$A$2:$A$100,MATCH('Communication Facility (Desc)'!$E6,[1]!MASTER_FACILITY_TYPE_DESC[#Data],0),0))","v":""},{"$f":"IF('Communication Facility (Desc)'!F6=\"\",\"\",INDEX([1]OWNER!$A$2:$A$100,MATCH('Communication Facility (Desc)'!$F6,[1]!MASTER_OWNER_DESC[#Data],0),0))","v":""},{"$f":"IF('Communication Facility (Desc)'!G6=\"\",\"\",IF('Communication Facility (Desc)'!G6=\"\",\"\",INDEX([1]COUNTY!$A$2:$A$80,MATCH('Communication Facility (Desc)'!G6,[1]!MASTER_COUNTY_NAME[#Data],0),0)))","v":""},{"$f":"IF('Communication Facility (Desc)'!H6=\"\",\"\",'Communication Facility (Desc)'!H6)","v":""},{"$f":"IF('Communication Facility (Desc)'!I6=\"\",\"\",'Communication Facility (Desc)'!I6)","v":""},{"$f":"IF('Communication Facility (Desc)'!J6=\"\",\"\",'Communication Facility (Desc)'!J6)","v":""},{"$f":"IF('Communication Facility (Desc)'!K6=\"\",\"\",INDEX([1]CABINET_TYPE!$A$2:$A$100,MATCH('Communication Facility (Desc)'!$K6,[1]!MASTER_CABINET_TYPE_DESC[#Data],0),0))","v":""},{"$f":"IF('Communication Facility (Desc)'!L6=\"\",\"\",INDEX([1]CABINET_MOUNT_TYPE!$A$2:$A$100,MATCH('Communication Facility (Desc)'!L6,[1]!MASTER_CABINET_MOUNT_TYPE_DESC[#Data],0),0))","v":""},{"$f":"IF('Communication Facility (Desc)'!M6=\"\",\"\",INDEX([1]YES_NO!$A$2:$A$100,MATCH('Communication Facility (Desc)'!M6,[1]!MASTER_YES_NO_DESC[#Data],0),0))","v":""},{"$f":"IF('Communication Facility (Desc)'!N6=\"\",\"\",INDEX([1]BUILDING_TYPE!$A$2:$A$100,MATCH('Communication Facility (Desc)'!$N6,[1]!MASTER_BUILDING_TYPE_DESC[#Data],0),0))","v":""},{"$f":"IF('Communication Facility (Desc)'!O6=\"\",\"\",'Communication Facility (Desc)'!O6)","v":""},{"$f":"IF('Communication Facility (Desc)'!P6=\"\",\"\",INDEX([1]BUILDING_MTL!$A$2:$A$100,MATCH('Communication Facility (Desc)'!$P6,[1]!MASTER_BUILDING_MTL_DESC[#Data],0),0))","v":""},{"$f":"IF('Communication Facility (Desc)'!Q6=\"\",\"\",INDEX([1]KEY_TYPE!$A$2:$A$100,MATCH('Communication Facility (Desc)'!$Q6,[1]!MASTER_KEY_TYPE_DESC[#Data],0),0))","v":""},{"$f":"IF('Communication Facility (Desc)'!R6=\"\",\"\",'Communication Facility (Desc)'!R6)","v":""},{"$f":"IF('Communication Facility (Desc)'!S6=\"\",\"\",INDEX([1]FILTER_TYPE!$A$2:$A$100,MATCH('Communication Facility (Desc)'!$S6,[1]!MASTER_FILTER_TYPE_DESC[#Data],0),0))","v":""},{"$f":"IF('Communication Facility (Desc)'!T6=\"\",\"\",INDEX([1]FILTER_SIZE!$A$2:$A$100,MATCH('Communication Facility (Desc)'!$T6,[1]!MASTER_FILTER_SIZE_DESC[#Data],0),0))","v":""},{"$f":"IF('Communication Facility (Desc)'!U6=\"\",\"\",'Communication Facility (Desc)'!U6)","v":""},{"$f":"IF('Communication Facility (Desc)'!V6=\"\",\"\",INDEX([1]YES_NO!$A$2:$A$100,MATCH('Communication Facility (Desc)'!$V6,[1]!MASTER_YES_NO_DESC[#Data],0),0))","v":""},{"$f":"IF('Communication Facility (Desc)'!W6=\"\",\"\",INDEX([1]YES_NO!$A$2:$A$100,MATCH('Communication Facility (Desc)'!$W6,[1]!MASTER_YES_NO_DESC[#Data],0),0))","v":""}]
{"$rows_left_out":121}