{"text_format":"1","workbook":"xlsx","n_sheets":4,"sheets":["RWIS (Desc)","RWIS (Code)","RWIS Sensor (Desc)","RWIS Sensor (Code)"],"not_rendered":{"charts":0,"images":0,"macros":1,"external_links":1,"defined_names":12,"comments":0,"pivot_tables":0},"unopened":[],"bounds":{"document_bytes":16777216,"sheet_cells":100000,"rows_first":2000,"rows_last":500,"rows_between":2000,"halvings":0,"cell_chars":16384,"cell_head_chars":4096},"cells_cut":0,"cells_raw":0,"read":"whole","date_system":"1900"}

{"sheet":"RWIS (Desc)","index":0,"n_rows":2,"n_cols":8,"rows_kept":2,"cut":false,"hidden":false,"merged":[]}
["Device Id\nfor update ","Site Identification Name","Latitude ","Longitude","Facility Owner","County","Installed Date (YYYY-MM-DD)","Device Name"]
["EQUIP_ID","SITE_NO\nREQUIRED FIELD","PRIM GEOM (Y)\nREQUIRED FIELD","PRIM GEOM (X)\nREQUIRED FIELD","OWNER_CD\nREQUIRED FIELD","COUNTY_CD\nREQUIRED FIELD","YEAR_INSTALLED","NAME\nREQUIRED FIELD"]

{"sheet":"RWIS (Code)","index":1,"n_rows":202,"n_cols":8,"rows_kept":202,"cut":false,"hidden":false,"merged":[]}
["Device Id\nfor update ","Site Identification Name","Latitude ","Longitude","Facility Owner","County","Installed Date (YYYY-MM-DD)","Device Name"]
["EQUIP_ID","SITE_NO\nREQUIRED FIELD","PRIM GEOM (Y) REQUIRED FIELD","PRIM GEOM (X) REQUIRED FIELD","OWNER_CD REQUIRED FIELD","COUNTY_CD REQUIRED FIELD","YEAR_INSTALLED","NAME\nREQUIRED FIELD"]
[{"$f":"IF('RWIS (Desc)'!A3=\"\",\"\",'RWIS (Desc)'!A3)","v":""},{"$f":"IF('RWIS (Desc)'!B3=\"\",\"\",'RWIS (Desc)'!B3)","v":""},{"$f":"IF('RWIS (Desc)'!C3=\"\",\"\",'RWIS (Desc)'!C3)","v":""},{"$f":"IF('RWIS (Desc)'!D3=\"\",\"\",'RWIS (Desc)'!D3)","v":""},{"$f":"IF('RWIS (Desc)'!E3=\"\",\"\",INDEX([1]OWNER!$A$2:$A$100,MATCH('RWIS (Desc)'!$E3,[1]!MASTER_OWNER_DESC[#Data],0),0))","v":""},{"$f":"IF('RWIS (Desc)'!F3=\"\",\"\",INDEX([1]COUNTY!$A$2:$A$80,MATCH('RWIS (Desc)'!F3,[1]!MASTER_COUNTY_NAME[#Data],0),0))","v":""},{"$f":"IF('RWIS (Desc)'!G3=\"\",\"\",'RWIS (Desc)'!G3)","v":""},{"$f":"IF('RWIS (Desc)'!H3=\"\",\"\",'RWIS (Desc)'!H3)","v":""}]
[{"$f":"IF('RWIS (Desc)'!A4=\"\",\"\",'RWIS (Desc)'!A4)","v":""},{"$f":"IF('RWIS (Desc)'!B4=\"\",\"\",'RWIS (Desc)'!B4)","v":""},{"$f":"IF('RWIS (Desc)'!C4=\"\",\"\",'RWIS (Desc)'!C4)","v":""},{"$f":"IF('RWIS (Desc)'!D4=\"\",\"\",'RWIS (Desc)'!D4)","v":""},{"$f":"IF('RWIS (Desc)'!E4=\"\",\"\",INDEX([1]OWNER!$A$2:$A$100,MATCH('RWIS (Desc)'!$E4,[1]!MASTER_OWNER_DESC[#Data],0),0))","v":""},{"$f":"IF('RWIS (Desc)'!F4=\"\",\"\",INDEX([1]COUNTY!$A$2:$A$80,MATCH('RWIS (Desc)'!F4,[1]!MASTER_COUNTY_NAME[#Data],0),0))","v":""},{"$f":"IF('RWIS (Desc)'!G4=\"\",\"\",'RWIS (Desc)'!G4)","v":""},{"$f":"IF('RWIS (Desc)'!H4=\"\",\"\",'RWIS (Desc)'!H4)","v":""}]
[{"$f":"IF('RWIS (Desc)'!A5=\"\",\"\",'RWIS (Desc)'!A5)","v":""},{"$f":"IF('RWIS (Desc)'!B5=\"\",\"\",'RWIS (Desc)'!B5)","v":""},{"$f":"IF('RWIS (Desc)'!C5=\"\",\"\",'RWIS (Desc)'!C5)","v":""},{"$f":"IF('RWIS (Desc)'!D5=\"\",\"\",'RWIS (Desc)'!D5)","v":""},{"$f":"IF('RWIS (Desc)'!E5=\"\",\"\",INDEX([1]OWNER!$A$2:$A$100,MATCH('RWIS (Desc)'!$E5,[1]!MASTER_OWNER_DESC[#Data],0),0))","v":""},{"$f":"IF('RWIS (Desc)'!F5=\"\",\"\",INDEX([1]COUNTY!$A$2:$A$80,MATCH('RWIS (Desc)'!F5,[1]!MASTER_COUNTY_NAME[#Data],0),0))","v":""},{"$f":"IF('RWIS (Desc)'!G5=\"\",\"\",'RWIS (Desc)'!G5)","v":""},{"$f":"IF('RWIS (Desc)'!H5=\"\",\"\",'RWIS (Desc)'!H5)","v":""}]
[{"$f":"IF('RWIS (Desc)'!A6=\"\",\"\",'RWIS (Desc)'!A6)","v":""},{"$f":"IF('RWIS (Desc)'!B6=\"\",\"\",'RWIS (Desc)'!B6)","v":""},{"$f":"IF('RWIS (Desc)'!C6=\"\",\"\",'RWIS (Desc)'!C6)","v":""},{"$f":"IF('RWIS (Desc)'!D6=\"\",\"\",'RWIS (Desc)'!D6)","v":""},{"$f":"IF('RWIS (Desc)'!E6=\"\",\"\",INDEX([1]OWNER!$A$2:$A$100,MATCH('RWIS (Desc)'!$E6,[1]!MASTER_OWNER_DESC[#Data],0),0))","v":""},{"$f":"IF('RWIS (Desc)'!F6=\"\",\"\",INDEX([1]COUNTY!$A$2:$A$80,MATCH('RWIS (Desc)'!F6,[1]!MASTER_COUNTY_NAME[#Data],0),0))","v":""},{"$f":"IF('RWIS (Desc)'!G6=\"\",\"\",'RWIS (Desc)'!G6)","v":""},{"$f":"IF('RWIS (Desc)'!H6=\"\",\"\",'RWIS (Desc)'!H6)","v":""}]
[{"$f":"IF('RWIS (Desc)'!A7=\"\",\"\",'RWIS (Desc)'!A7)","v":""},{"$f":"IF('RWIS (Desc)'!B7=\"\",\"\",'RWIS (Desc)'!B7)","v":""},{"$f":"IF('RWIS (Desc)'!C7=\"\",\"\",'RWIS (Desc)'!C7)","v":""},{"$f":"IF('RWIS (Desc)'!D7=\"\",\"\",'RWIS (Desc)'!D7)","v":""},{"$f":"IF('RWIS (Desc)'!E7=\"\",\"\",INDEX([1]OWNER!$A$2:$A$100,MATCH('RWIS (Desc)'!$E7,[1]!MASTER_OWNER_DESC[#Data],0),0))","v":""},{"$f":"IF('RWIS (Desc)'!F7=\"\",\"\",INDEX([1]COUNTY!$A$2:$A$80,MATCH('RWIS (Desc)'!F7,[1]!MASTER_COUNTY_NAME[#Data],0),0))","v":""},{"$f":"IF('RWIS (Desc)'!G7=\"\",\"\",'RWIS (Desc)'!G7)","v":""},{"$f":"IF('RWIS (Desc)'!H7=\"\",\"\",'RWIS (Desc)'!H7)","v":""}]
[{"$f":"IF('RWIS (Desc)'!A8=\"\",\"\",'RWIS (Desc)'!A8)","v":""},{"$f":"IF('RWIS (Desc)'!B8=\"\",\"\",'RWIS (Desc)'!B8)","v":""},{"$f":"IF('RWIS (Desc)'!C8=\"\",\"\",'RWIS (Desc)'!C8)","v":""},{"$f":"IF('RWIS (Desc)'!D8=\"\",\"\",'RWIS (Desc)'!D8)","v":""},{"$f":"IF('RWIS (Desc)'!E8=\"\",\"\",INDEX([1]OWNER!$A$2:$A$100,MATCH('RWIS (Desc)'!$E8,[1]!MASTER_OWNER_DESC[#Data],0),0))","v":""},{"$f":"IF('RWIS (Desc)'!F8=\"\",\"\",INDEX([1]COUNTY!$A$2:$A$80,MATCH('RWIS (Desc)'!F8,[1]!MASTER_COUNTY_NAME[#Data],0),0))","v":""},{"$f":"IF('RWIS (Desc)'!G8=\"\",\"\",'RWIS (Desc)'!G8)","v":""},{"$f":"IF('RWIS (Desc)'!H8=\"\",\"\",'RWIS (Desc)'!H8)","v":""}]
[{"$f":"IF('RWIS (Desc)'!A9=\"\",\"\",'RWIS (Desc)'!A9)","v":""},{"$f":"IF('RWIS (Desc)'!B9=\"\",\"\",'RWIS (Desc)'!B9)","v":""},{"$f":"IF('RWIS (Desc)'!C9=\"\",\"\",'RWIS (Desc)'!C9)","v":""},{"$f":"IF('RWIS (Desc)'!D9=\"\",\"\",'RWIS (Desc)'!D9)","v":""},{"$f":"IF('RWIS (Desc)'!E9=\"\",\"\",INDEX([1]OWNER!$A$2:$A$100,MATCH('RWIS (Desc)'!$E9,[1]!MASTER_OWNER_DESC[#Data],0),0))","v":""},{"$f":"IF('RWIS (Desc)'!F9=\"\",\"\",INDEX([1]COUNTY!$A$2:$A$80,MATCH('RWIS (Desc)'!F9,[1]!MASTER_COUNTY_NAME[#Data],0),0))","v":""},{"$f":"IF('RWIS (Desc)'!G9=\"\",\"\",'RWIS (Desc)'!G9)","v":""},{"$f":"IF('RWIS (Desc)'!H9=\"\",\"\",'RWIS (Desc)'!H9)","v":""}]
[{"$f":"IF('RWIS (Desc)'!A10=\"\",\"\",'RWIS (Desc)'!A10)","v":""},{"$f":"IF('RWIS (Desc)'!B10=\"\",\"\",'RWIS (Desc)'!B10)","v":""},{"$f":"IF('RWIS (Desc)'!C10=\"\",\"\",'RWIS (Desc)'!C10)","v":""},{"$f":"IF('RWIS (Desc)'!D10=\"\",\"\",'RWIS (Desc)'!D10)","v":""},{"$f":"IF('RWIS (Desc)'!E10=\"\",\"\",INDEX([1]OWNER!$A$2:$A$100,MATCH('RWIS (Desc)'!$E10,[1]!MASTER_OWNER_DESC[#Data],0),0))","v":""},{"$f":"IF('RWIS (Desc)'!F10=\"\",\"\",INDEX([1]COUNTY!$A$2:$A$80,MATCH('RWIS (Desc)'!F10,[1]!MASTER_COUNTY_NAME[#Data],0),0))","v":""},{"$f":"IF('RWIS (Desc)'!G10=\"\",\"\",'RWIS (Desc)'!G10)","v":""},{"$f":"IF('RWIS (Desc)'!H10=\"\",\"\",'RWIS (Desc)'!H10)","v":""}]
[{"$f":"IF('RWIS (Desc)'!A11=\"\",\"\",'RWIS (Desc)'!A11)","v":""},{"$f":"IF('RWIS (Desc)'!B11=\"\",\"\",'RWIS (Desc)'!B11)","v":""},{"$f":"IF('RWIS (Desc)'!C11=\"\",\"\",'RWIS (Desc)'!C11)","v":""},{"$f":"IF('RWIS (Desc)'!D11=\"\",\"\",'RWIS (Desc)'!D11)","v":""},{"$f":"IF('RWIS (Desc)'!E11=\"\",\"\",INDEX([1]OWNER!$A$2:$A$100,MATCH('RWIS (Desc)'!$E11,[1]!MASTER_OWNER_DESC[#Data],0),0))","v":""},{"$f":"IF('RWIS (Desc)'!F11=\"\",\"\",INDEX([1]COUNTY!$A$2:$A$80,MATCH('RWIS (Desc)'!F11,[1]!MASTER_COUNTY_NAME[#Data],0),0))","v":""},{"$f":"IF('RWIS (Desc)'!G11=\"\",\"\",'RWIS (Desc)'!G11)","v":""},{"$f":"IF('RWIS (Desc)'!H11=\"\",\"\",'RWIS (Desc)'!H11)","v":""}]
[{"$f":"IF('RWIS (Desc)'!A12=\"\",\"\",'RWIS (Desc)'!A12)","v":""},{"$f":"IF('RWIS (Desc)'!B12=\"\",\"\",'RWIS (Desc)'!B12)","v":""},{"$f":"IF('RWIS (Desc)'!C12=\"\",\"\",'RWIS (Desc)'!C12)","v":""},{"$f":"IF('RWIS (Desc)'!D12=\"\",\"\",'RWIS (Desc)'!D12)","v":""},{"$f":"IF('RWIS (Desc)'!E12=\"\",\"\",INDEX([1]OWNER!$A$2:$A$100,MATCH('RWIS (Desc)'!$E12,[1]!MASTER_OWNER_DESC[#Data],0),0))","v":""},{"$f":"IF('RWIS (Desc)'!F12=\"\",\"\",INDEX([1]COUNTY!$A$2:$A$80,MATCH('RWIS (Desc)'!F12,[1]!MASTER_COUNTY_NAME[#Data],0),0))","v":""},{"$f":"IF('RWIS (Desc)'!G12=\"\",\"\",'RWIS (Desc)'!G12)","v":""},{"$f":"IF('RWIS (Desc)'!H12=\"\",\"\",'RWIS (Desc)'!H12)","v":""}]
[{"$f":"IF('RWIS (Desc)'!A13=\"\",\"\",'RWIS (Desc)'!A13)","v":""},{"$f":"IF('RWIS (Desc)'!B13=\"\",\"\",'RWIS (Desc)'!B13)","v":""},{"$f":"IF('RWIS (Desc)'!C13=\"\",\"\",'RWIS (Desc)'!C13)","v":""},{"$f":"IF('RWIS (Desc)'!D13=\"\",\"\",'RWIS (Desc)'!D13)","v":""},{"$f":"IF('RWIS (Desc)'!E13=\"\",\"\",INDEX([1]OWNER!$A$2:$A$100,MATCH('RWIS (Desc)'!$E13,[1]!MASTER_OWNER_DESC[#Data],0),0))","v":""},{"$f":"IF('RWIS (Desc)'!F13=\"\",\"\",INDEX([1]COUNTY!$A$2:$A$80,MATCH('RWIS (Desc)'!F13,[1]!MASTER_COUNTY_NAME[#Data],0),0))","v":""},{"$f":"IF('RWIS (Desc)'!G13=\"\",\"\",'RWIS (Desc)'!G13)","v":""},{"$f":"IF('RWIS (Desc)'!H13=\"\",\"\",'RWIS (Desc)'!H13)","v":""}]
[{"$f":"IF('RWIS (Desc)'!A14=\"\",\"\",'RWIS (Desc)'!A14)","v":""},{"$f":"IF('RWIS (Desc)'!B14=\"\",\"\",'RWIS (Desc)'!B14)","v":""},{"$f":"IF('RWIS (Desc)'!C14=\"\",\"\",'RWIS (Desc)'!C14)","v":""},{"$f":"IF('RWIS (Desc)'!D14=\"\",\"\",'RWIS (Desc)'!D14)","v":""},{"$f":"IF('RWIS (Desc)'!E14=\"\",\"\",INDEX([1]OWNER!$A$2:$A$100,MATCH('RWIS (Desc)'!$E14,[1]!MASTER_OWNER_DESC[#Data],0),0))","v":""},{"$f":"IF('RWIS (Desc)'!F14=\"\",\"\",INDEX([1]COUNTY!$A$2:$A$80,MATCH('RWIS (Desc)'!F14,[1]!MASTER_COUNTY_NAME[#Data],0),0))","v":""},{"$f":"IF('RWIS (Desc)'!G14=\"\",\"\",'RWIS (Desc)'!G14)","v":""},{"$f":"IF('RWIS (Desc)'!H14=\"\",\"\",'RWIS (Desc)'!H14)","v":""}]
[{"$f":"IF('RWIS (Desc)'!A15=\"\",\"\",'RWIS (Desc)'!A15)","v":""},{"$f":"IF('RWIS (Desc)'!B15=\"\",\"\",'RWIS (Desc)'!B15)","v":""},{"$f":"IF('RWIS (Desc)'!C15=\"\",\"\",'RWIS (Desc)'!C15)","v":""},{"$f":"IF('RWIS (Desc)'!D15=\"\",\"\",'RWIS (Desc)'!D15)","v":""},{"$f":"IF('RWIS (Desc)'!E15=\"\",\"\",INDEX([1]OWNER!$A$2:$A$100,MATCH('RWIS (Desc)'!$E15,[1]!MASTER_OWNER_DESC[#Data],0),0))","v":""},{"$f":"IF('RWIS (Desc)'!F15=\"\",\"\",INDEX([1]COUNTY!$A$2:$A$80,MATCH('RWIS (Desc)'!F15,[1]!MASTER_COUNTY_NAME[#Data],0),0))","v":""},{"$f":"IF('RWIS (Desc)'!G15=\"\",\"\",'RWIS (Desc)'!G15)","v":""},{"$f":"IF('RWIS (Desc)'!H15=\"\",\"\",'RWIS (Desc)'!H15)","v":""}]
{"$rows_left_out":188}
{"sheet":"RWIS Sensor (Desc)","index":2,"n_rows":2,"n_cols":9,"rows_kept":2,"cut":false,"hidden":false,"merged":[]}
["Device Id\nfor update ","Site Identification Name\nRWIS Equipment Cabinet SIN","Device ID","Previous Name","Sensor Type ","Installed Date (YYYY/MM/DD)","Manufacturer","Model ","Serial Number "]
["EQUIP_ID","This Field is for Reference Only\nDO NOT IMPORT","EQUIP_LOC_ID\nREQUIRED FIELD","This Field is for Reference Only\nDO NOT IMPORT","RWIS_SENSOR_TYPE_CD\nREQUIRED FIELD ","YEAR_INSTALLED","RWIS_SENSOR_MANUF_CD ","RWIS_SENSOR_MODEL_CD ","SERIAL_NUMBER"]

{"sheet":"RWIS Sensor (Code)","index":3,"n_rows":202,"n_cols":8,"rows_kept":202,"cut":false,"hidden":false,"merged":[]}
["Device Id\nfor update ","Parent ITS Device Entity Cd","Device ID","Sensor Type ","Installed Date (YYYY/MM/DD)","Manufacturer","Model ","Serial Number "]
["EQUIP_ID","ENTITY_ID\nREQUIRED FIELD","EQUIP_LOC_ID                     REQUIRED FIELD","RWIS_SENSOR_TYPE_CD REQUIRED FIELD ","YEAR_INSTALLED","RWIS_SENSOR_MANUF_CD ","RWIS_SENSOR_MODEL_CD ","SERIAL_NUMBER"]
[{"$f":"IF('RWIS Sensor (Desc)'!A3=\"\",\"\",'RWIS Sensor (Desc)'!A3)","v":""},{"$f":"IF('RWIS Sensor (Desc)'!C3=\"\",\"\",\"2008\")","v":""},{"$f":"IF('RWIS Sensor (Desc)'!C3=\"\",\"\",'RWIS Sensor (Desc)'!C3)","v":""},{"$f":"IF('RWIS Sensor (Desc)'!E3=\"\",\"\",INDEX([1]RWIS_SENSOR_TYPE!$A$2:$A$100,MATCH('RWIS Sensor (Desc)'!$E3,[1]!MASTER_RWIS_SENSOR_TYPE_DESC[#Data],0),0))","v":""},{"$f":"IF('RWIS Sensor (Desc)'!F3=\"\",\"\",'RWIS Sensor (Desc)'!F3)","v":""},{"$f":"IF('RWIS Sensor (Desc)'!G3=\"\",\"\",INDEX([1]RWIS_SENSOR_MODEL!$B$2:$B$100,MATCH(1,([1]RWIS_SENSOR_MODEL!$C$2:$C$100='RWIS Sensor (Desc)'!$G3)*([1]RWIS_SENSOR_MODEL!$E$2:$E$100='RWIS Sensor (Code)'!$D3),0),0))","v":""},{"$f":"IF('RWIS Sensor (Desc)'!H3=\"\",\"\",INDEX([1]RWIS_SENSOR_MODEL!$A$2:$A$100,MATCH(1,([1]RWIS_SENSOR_MODEL!$C$2:$C$100='RWIS Sensor (Desc)'!$G3)*([1]RWIS_SENSOR_MODEL!$D$2:$D$100='RWIS Sensor (Desc)'!$H3)*([1]RWIS_SENSOR_MODEL!$E$2:$E$100='RWIS Sensor (Code)'!$D3),0),0))","v":""},{"$f":"IF('RWIS Sensor (Desc)'!I3=\"\",\"\",'RWIS Sensor (Desc)'!I3)","v":""}]
[{"$f":"IF('RWIS Sensor (Desc)'!A4=\"\",\"\",'RWIS Sensor (Desc)'!A4)","v":""},{"$f":"IF('RWIS Sensor (Desc)'!C4=\"\",\"\",\"2008\")","v":""},{"$f":"IF('RWIS Sensor (Desc)'!C4=\"\",\"\",'RWIS Sensor (Desc)'!C4)","v":""},{"$f":"IF('RWIS Sensor (Desc)'!E4=\"\",\"\",INDEX([1]RWIS_SENSOR_TYPE!$A$2:$A$100,MATCH('RWIS Sensor (Desc)'!$E4,[1]!MASTER_RWIS_SENSOR_TYPE_DESC[#Data],0),0))","v":""},{"$f":"IF('RWIS Sensor (Desc)'!F4=\"\",\"\",'RWIS Sensor (Desc)'!F4)","v":""},{"$f":"IF('RWIS Sensor (Desc)'!G4=\"\",\"\",INDEX([1]RWIS_SENSOR_MODEL!$B$2:$B$100,MATCH(1,([1]RWIS_SENSOR_MODEL!$C$2:$C$100='RWIS Sensor (Desc)'!$G4)*([1]RWIS_SENSOR_MODEL!$E$2:$E$100='RWIS Sensor (Code)'!$D4),0),0))","v":""},{"$f":"IF('RWIS Sensor (Desc)'!H4=\"\",\"\",INDEX([1]RWIS_SENSOR_MODEL!$A$2:$A$100,MATCH(1,([1]RWIS_SENSOR_MODEL!$C$2:$C$100='RWIS Sensor (Desc)'!$G4)*([1]RWIS_SENSOR_MODEL!$D$2:$D$100='RWIS Sensor (Desc)'!$H4)*([1]RWIS_SENSOR_MODEL!$E$2:$E$100='RWIS Sensor (Code)'!$D4),0),0))","v":""},{"$f":"IF('RWIS Sensor (Desc)'!I4=\"\",\"\",'RWIS Sensor (Desc)'!I4)","v":""}]
[{"$f":"IF('RWIS Sensor (Desc)'!A5=\"\",\"\",'RWIS Sensor (Desc)'!A5)","v":""},{"$f":"IF('RWIS Sensor (Desc)'!C5=\"\",\"\",\"2008\")","v":""},{"$f":"IF('RWIS Sensor (Desc)'!C5=\"\",\"\",'RWIS Sensor (Desc)'!C5)","v":""},{"$f":"IF('RWIS Sensor (Desc)'!E5=\"\",\"\",INDEX([1]RWIS_SENSOR_TYPE!$A$2:$A$100,MATCH('RWIS Sensor (Desc)'!$E5,[1]!MASTER_RWIS_SENSOR_TYPE_DESC[#Data],0),0))","v":""},{"$f":"IF('RWIS Sensor (Desc)'!F5=\"\",\"\",'RWIS Sensor (Desc)'!F5)","v":""},{"$f":"IF('RWIS Sensor (Desc)'!G5=\"\",\"\",INDEX([1]RWIS_SENSOR_MODEL!$B$2:$B$100,MATCH(1,([1]RWIS_SENSOR_MODEL!$C$2:$C$100='RWIS Sensor (Desc)'!$G5)*([1]RWIS_SENSOR_MODEL!$E$2:$E$100='RWIS Sensor (Code)'!$D5),0),0))","v":""},{"$f":"IF('RWIS Sensor (Desc)'!H5=\"\",\"\",INDEX([1]RWIS_SENSOR_MODEL!$A$2:$A$100,MATCH(1,([1]RWIS_SENSOR_MODEL!$C$2:$C$100='RWIS Sensor (Desc)'!$G5)*([1]RWIS_SENSOR_MODEL!$D$2:$D$100='RWIS Sensor (Desc)'!$H5)*([1]RWIS_SENSOR_MODEL!$E$2:$E$100='RWIS Sensor (Code)'!$D5),0),0))","v":""},{"$f":"IF('RWIS Sensor (Desc)'!I5=\"\",\"\",'RWIS Sensor (Desc)'!I5)","v":""}]
[{"$f":"IF('RWIS Sensor (Desc)'!A6=\"\",\"\",'RWIS Sensor (Desc)'!A6)","v":""},{"$f":"IF('RWIS Sensor (Desc)'!C6=\"\",\"\",\"2008\")","v":""},{"$f":"IF('RWIS Sensor (Desc)'!C6=\"\",\"\",'RWIS Sensor (Desc)'!C6)","v":""},{"$f":"IF('RWIS Sensor (Desc)'!E6=\"\",\"\",INDEX([1]RWIS_SENSOR_TYPE!$A$2:$A$100,MATCH('RWIS Sensor (Desc)'!$E6,[1]!MASTER_RWIS_SENSOR_TYPE_DESC[#Data],0),0))","v":""},{"$f":"IF('RWIS Sensor (Desc)'!F6=\"\",\"\",'RWIS Sensor (Desc)'!F6)","v":""},{"$f":"IF('RWIS Sensor (Desc)'!G6=\"\",\"\",INDEX([1]RWIS_SENSOR_MODEL!$B$2:$B$100,MATCH(1,([1]RWIS_SENSOR_MODEL!$C$2:$C$100='RWIS Sensor (Desc)'!$G6)*([1]RWIS_SENSOR_MODEL!$E$2:$E$100='RWIS Sensor (Code)'!$D6),0),0))","v":""},{"$f":"IF('RWIS Sensor (Desc)'!H6=\"\",\"\",INDEX([1]RWIS_SENSOR_MODEL!$A$2:$A$100,MATCH(1,([1]RWIS_SENSOR_MODEL!$C$2:$C$100='RWIS Sensor (Desc)'!$G6)*([1]RWIS_SENSOR_MODEL!$D$2:$D$100='RWIS Sensor (Desc)'!$H6)*([1]RWIS_SENSOR_MODEL!$E$2:$E$100='RWIS Sensor (Code)'!$D6),0),0))","v":""},{"$f":"IF('RWIS Sensor (Desc)'!I6=\"\",\"\",'RWIS Sensor (Desc)'!I6)","v":""}]
[{"$f":"IF('RWIS Sensor (Desc)'!A7=\"\",\"\",'RWIS Sensor (Desc)'!A7)","v":""},{"$f":"IF('RWIS Sensor (Desc)'!C7=\"\",\"\",\"2008\")","v":""},{"$f":"IF('RWIS Sensor (Desc)'!C7=\"\",\"\",'RWIS Sensor (Desc)'!C7)","v":""},{"$f":"IF('RWIS Sensor (Desc)'!E7=\"\",\"\",INDEX([1]RWIS_SENSOR_TYPE!$A$2:$A$100,MATCH('RWIS Sensor (Desc)'!$E7,[1]!MASTER_RWIS_SENSOR_TYPE_DESC[#Data],0),0))","v":""},{"$f":"IF('RWIS Sensor (Desc)'!F7=\"\",\"\",'RWIS Sensor (Desc)'!F7)","v":""},{"$f":"IF('RWIS Sensor (Desc)'!G7=\"\",\"\",INDEX([1]RWIS_SENSOR_MODEL!$B$2:$B$100,MATCH(1,([1]RWIS_SENSOR_MODEL!$C$2:$C$100='RWIS Sensor (Desc)'!$G7)*([1]RWIS_SENSOR_MODEL!$E$2:$E$100='RWIS Sensor (Code)'!$D7),0),0))","v":""},{"$f":"IF('RWIS Sensor (Desc)'!H7=\"\",\"\",INDEX([1]RWIS_SENSOR_MODEL!$A$2:$A$100,MATCH(1,([1]RWIS_SENSOR_MODEL!$C$2:$C$100='RWIS Sensor (Desc)'!$G7)*([1]RWIS_SENSOR_MODEL!$D$2:$D$100='RWIS Sensor (Desc)'!$H7)*([1]RWIS_SENSOR_MODEL!$E$2:$E$100='RWIS Sensor (Code)'!$D7),0),0))","v":""},{"$f":"IF('RWIS Sensor (Desc)'!I7=\"\",\"\",'RWIS Sensor (Desc)'!I7)","v":""}]
[{"$f":"IF('RWIS Sensor (Desc)'!A8=\"\",\"\",'RWIS Sensor (Desc)'!A8)","v":""},{"$f":"IF('RWIS Sensor (Desc)'!C8=\"\",\"\",\"2008\")","v":""},{"$f":"IF('RWIS Sensor (Desc)'!C8=\"\",\"\",'RWIS Sensor (Desc)'!C8)","v":""},{"$f":"IF('RWIS Sensor (Desc)'!E8=\"\",\"\",INDEX([1]RWIS_SENSOR_TYPE!$A$2:$A$100,MATCH('RWIS Sensor (Desc)'!$E8,[1]!MASTER_RWIS_SENSOR_TYPE_DESC[#Data],0),0))","v":""},{"$f":"IF('RWIS Sensor (Desc)'!F8=\"\",\"\",'RWIS Sensor (Desc)'!F8)","v":""},{"$f":"IF('RWIS Sensor (Desc)'!G8=\"\",\"\",INDEX([1]RWIS_SENSOR_MODEL!$B$2:$B$100,MATCH(1,([1]RWIS_SENSOR_MODEL!$C$2:$C$100='RWIS Sensor (Desc)'!$G8)*([1]RWIS_SENSOR_MODEL!$E$2:$E$100='RWIS Sensor (Code)'!$D8),0),0))","v":""},{"$f":"IF('RWIS Sensor (Desc)'!H8=\"\",\"\",INDEX([1]RWIS_SENSOR_MODEL!$A$2:$A$100,MATCH(1,([1]RWIS_SENSOR_MODEL!$C$2:$C$100='RWIS Sensor (Desc)'!$G8)*([1]RWIS_SENSOR_MODEL!$D$2:$D$100='RWIS Sensor (Desc)'!$H8)*([1]RWIS_SENSOR_MODEL!$E$2:$E$100='RWIS Sensor (Code)'!$D8),0),0))","v":""},{"$f":"IF('RWIS Sensor (Desc)'!I8=\"\",\"\",'RWIS Sensor (Desc)'!I8)","v":""}]
[{"$f":"IF('RWIS Sensor (Desc)'!A9=\"\",\"\",'RWIS Sensor (Desc)'!A9)","v":""},{"$f":"IF('RWIS Sensor (Desc)'!C9=\"\",\"\",\"2008\")","v":""},{"$f":"IF('RWIS Sensor (Desc)'!C9=\"\",\"\",'RWIS Sensor (Desc)'!C9)","v":""},{"$f":"IF('RWIS Sensor (Desc)'!E9=\"\",\"\",INDEX([1]RWIS_SENSOR_TYPE!$A$2:$A$100,MATCH('RWIS Sensor (Desc)'!$E9,[1]!MASTER_RWIS_SENSOR_TYPE_DESC[#Data],0),0))","v":""},{"$f":"IF('RWIS Sensor (Desc)'!F9=\"\",\"\",'RWIS Sensor (Desc)'!F9)","v":""},{"$f":"IF('RWIS Sensor (Desc)'!G9=\"\",\"\",INDEX([1]RWIS_SENSOR_MODEL!$B$2:$B$100,MATCH(1,([1]RWIS_SENSOR_MODEL!$C$2:$C$100='RWIS Sensor (Desc)'!$G9)*([1]RWIS_SENSOR_MODEL!$E$2:$E$100='RWIS Sensor (Code)'!$D9),0),0))","v":""},{"$f":"IF('RWIS Sensor (Desc)'!H9=\"\",\"\",INDEX([1]RWIS_SENSOR_MODEL!$A$2:$A$100,MATCH(1,([1]RWIS_SENSOR_MODEL!$C$2:$C$100='RWIS Sensor (Desc)'!$G9)*([1]RWIS_SENSOR_MODEL!$D$2:$D$100='RWIS Sensor (Desc)'!$H9)*([1]RWIS_SENSOR_MODEL!$E$2:$E$100='RWIS Sensor (Code)'!$D9),0),0))","v":""},{"$f":"IF('RWIS Sensor (Desc)'!I9=\"\",\"\",'RWIS Sensor (Desc)'!I9)","v":""}]
[{"$f":"IF('RWIS Sensor (Desc)'!A10=\"\",\"\",'RWIS Sensor (Desc)'!A10)","v":""},{"$f":"IF('RWIS Sensor (Desc)'!C10=\"\",\"\",\"2008\")","v":""},{"$f":"IF('RWIS Sensor (Desc)'!C10=\"\",\"\",'RWIS Sensor (Desc)'!C10)","v":""},{"$f":"IF('RWIS Sensor (Desc)'!E10=\"\",\"\",INDEX([1]RWIS_SENSOR_TYPE!$A$2:$A$100,MATCH('RWIS Sensor (Desc)'!$E10,[1]!MASTER_RWIS_SENSOR_TYPE_DESC[#Data],0),0))","v":""},{"$f":"IF('RWIS Sensor (Desc)'!F10=\"\",\"\",'RWIS Sensor (Desc)'!F10)","v":""},{"$f":"IF('RWIS Sensor (Desc)'!G10=\"\",\"\",INDEX([1]RWIS_SENSOR_MODEL!$B$2:$B$100,MATCH(1,([1]RWIS_SENSOR_MODEL!$C$2:$C$100='RWIS Sensor (Desc)'!$G10)*([1]RWIS_SENSOR_MODEL!$E$2:$E$100='RWIS Sensor (Code)'!$D10),0),0))","v":""},{"$f":"IF('RWIS Sensor (Desc)'!H10=\"\",\"\",INDEX([1]RWIS_SENSOR_MODEL!$A$2:$A$100,MATCH(1,([1]RWIS_SENSOR_MODEL!$C$2:$C$100='RWIS Sensor (Desc)'!$G10)*([1]RWIS_SENSOR_MODEL!$D$2:$D$100='RWIS Sensor (Desc)'!$H10)*([1]RWIS_SENSOR_MODEL!$E$2:$E$100='RWIS Sensor (Code)'!$D10),0),0))","v":""},{"$f":"IF('RWIS Sensor (Desc)'!I10=\"\",\"\",'RWIS Sensor (Desc)'!I10)","v":""}]
[{"$f":"IF('RWIS Sensor (Desc)'!A11=\"\",\"\",'RWIS Sensor (Desc)'!A11)","v":""},{"$f":"IF('RWIS Sensor (Desc)'!C11=\"\",\"\",\"2008\")","v":""},{"$f":"IF('RWIS Sensor (Desc)'!C11=\"\",\"\",'RWIS Sensor (Desc)'!C11)","v":""},{"$f":"IF('RWIS Sensor (Desc)'!E11=\"\",\"\",INDEX([1]RWIS_SENSOR_TYPE!$A$2:$A$100,MATCH('RWIS Sensor (Desc)'!$E11,[1]!MASTER_RWIS_SENSOR_TYPE_DESC[#Data],0),0))","v":""},{"$f":"IF('RWIS Sensor (Desc)'!F11=\"\",\"\",'RWIS Sensor (Desc)'!F11)","v":""},{"$f":"IF('RWIS Sensor (Desc)'!G11=\"\",\"\",INDEX([1]RWIS_SENSOR_MODEL!$B$2:$B$100,MATCH(1,([1]RWIS_SENSOR_MODEL!$C$2:$C$100='RWIS Sensor (Desc)'!$G11)*([1]RWIS_SENSOR_MODEL!$E$2:$E$100='RWIS Sensor (Code)'!$D11),0),0))","v":""},{"$f":"IF('RWIS Sensor (Desc)'!H11=\"\",\"\",INDEX([1]RWIS_SENSOR_MODEL!$A$2:$A$100,MATCH(1,([1]RWIS_SENSOR_MODEL!$C$2:$C$100='RWIS Sensor (Desc)'!$G11)*([1]RWIS_SENSOR_MODEL!$D$2:$D$100='RWIS Sensor (Desc)'!$H11)*([1]RWIS_SENSOR_MODEL!$E$2:$E$100='RWIS Sensor (Code)'!$D11),0),0))","v":""},{"$f":"IF('RWIS Sensor (Desc)'!I11=\"\",\"\",'RWIS Sensor (Desc)'!I11)","v":""}]
[{"$f":"IF('RWIS Sensor (Desc)'!A12=\"\",\"\",'RWIS Sensor (Desc)'!A12)","v":""},{"$f":"IF('RWIS Sensor (Desc)'!C12=\"\",\"\",\"2008\")","v":""},{"$f":"IF('RWIS Sensor (Desc)'!C12=\"\",\"\",'RWIS Sensor (Desc)'!C12)","v":""},{"$f":"IF('RWIS Sensor (Desc)'!E12=\"\",\"\",INDEX([1]RWIS_SENSOR_TYPE!$A$2:$A$100,MATCH('RWIS Sensor (Desc)'!$E12,[1]!MASTER_RWIS_SENSOR_TYPE_DESC[#Data],0),0))","v":""},{"$f":"IF('RWIS Sensor (Desc)'!F12=\"\",\"\",'RWIS Sensor (Desc)'!F12)","v":""},{"$f":"IF('RWIS Sensor (Desc)'!G12=\"\",\"\",INDEX([1]RWIS_SENSOR_MODEL!$B$2:$B$100,MATCH(1,([1]RWIS_SENSOR_MODEL!$C$2:$C$100='RWIS Sensor (Desc)'!$G12)*([1]RWIS_SENSOR_MODEL!$E$2:$E$100='RWIS Sensor (Code)'!$D12),0),0))","v":""},{"$f":"IF('RWIS Sensor (Desc)'!H12=\"\",\"\",INDEX([1]RWIS_SENSOR_MODEL!$A$2:$A$100,MATCH(1,([1]RWIS_SENSOR_MODEL!$C$2:$C$100='RWIS Sensor (Desc)'!$G12)*([1]RWIS_SENSOR_MODEL!$D$2:$D$100='RWIS Sensor (Desc)'!$H12)*([1]RWIS_SENSOR_MODEL!$E$2:$E$100='RWIS Sensor (Code)'!$D12),0),0))","v":""},{"$f":"IF('RWIS Sensor (Desc)'!I12=\"\",\"\",'RWIS Sensor (Desc)'!I12)","v":""}]
[{"$f":"IF('RWIS Sensor (Desc)'!A13=\"\",\"\",'RWIS Sensor (Desc)'!A13)","v":""},{"$f":"IF('RWIS Sensor (Desc)'!C13=\"\",\"\",\"2008\")","v":""},{"$f":"IF('RWIS Sensor (Desc)'!C13=\"\",\"\",'RWIS Sensor (Desc)'!C13)","v":""},{"$f":"IF('RWIS Sensor (Desc)'!E13=\"\",\"\",INDEX([1]RWIS_SENSOR_TYPE!$A$2:$A$100,MATCH('RWIS Sensor (Desc)'!$E13,[1]!MASTER_RWIS_SENSOR_TYPE_DESC[#Data],0),0))","v":""},{"$f":"IF('RWIS Sensor (Desc)'!F13=\"\",\"\",'RWIS Sensor (Desc)'!F13)","v":""},{"$f":"IF('RWIS Sensor (Desc)'!G13=\"\",\"\",INDEX([1]RWIS_SENSOR_MODEL!$B$2:$B$100,MATCH(1,([1]RWIS_SENSOR_MODEL!$C$2:$C$100='RWIS Sensor (Desc)'!$G13)*([1]RWIS_SENSOR_MODEL!$E$2:$E$100='RWIS Sensor (Code)'!$D13),0),0))","v":""},{"$f":"IF('RWIS Sensor (Desc)'!H13=\"\",\"\",INDEX([1]RWIS_SENSOR_MODEL!$A$2:$A$100,MATCH(1,([1]RWIS_SENSOR_MODEL!$C$2:$C$100='RWIS Sensor (Desc)'!$G13)*([1]RWIS_SENSOR_MODEL!$D$2:$D$100='RWIS Sensor (Desc)'!$H13)*([1]RWIS_SENSOR_MODEL!$E$2:$E$100='RWIS Sensor (Code)'!$D13),0),0))","v":""},{"$f":"IF('RWIS Sensor (Desc)'!I13=\"\",\"\",'RWIS Sensor (Desc)'!I13)","v":""}]
[{"$f":"IF('RWIS Sensor (Desc)'!A14=\"\",\"\",'RWIS Sensor (Desc)'!A14)","v":""},{"$f":"IF('RWIS Sensor (Desc)'!C14=\"\",\"\",\"2008\")","v":""},{"$f":"IF('RWIS Sensor (Desc)'!C14=\"\",\"\",'RWIS Sensor (Desc)'!C14)","v":""},{"$f":"IF('RWIS Sensor (Desc)'!E14=\"\",\"\",INDEX([1]RWIS_SENSOR_TYPE!$A$2:$A$100,MATCH('RWIS Sensor (Desc)'!$E14,[1]!MASTER_RWIS_SENSOR_TYPE_DESC[#Data],0),0))","v":""},{"$f":"IF('RWIS Sensor (Desc)'!F14=\"\",\"\",'RWIS Sensor (Desc)'!F14)","v":""},{"$f":"IF('RWIS Sensor (Desc)'!G14=\"\",\"\",INDEX([1]RWIS_SENSOR_MODEL!$B$2:$B$100,MATCH(1,([1]RWIS_SENSOR_MODEL!$C$2:$C$100='RWIS Sensor (Desc)'!$G14)*([1]RWIS_SENSOR_MODEL!$E$2:$E$100='RWIS Sensor (Code)'!$D14),0),0))","v":""},{"$f":"IF('RWIS Sensor (Desc)'!H14=\"\",\"\",INDEX([1]RWIS_SENSOR_MODEL!$A$2:$A$100,MATCH(1,([1]RWIS_SENSOR_MODEL!$C$2:$C$100='RWIS Sensor (Desc)'!$G14)*([1]RWIS_SENSOR_MODEL!$D$2:$D$100='RWIS Sensor (Desc)'!$H14)*([1]RWIS_SENSOR_MODEL!$E$2:$E$100='RWIS Sensor (Code)'!$D14),0),0))","v":""},{"$f":"IF('RWIS Sensor (Desc)'!I14=\"\",\"\",'RWIS Sensor (Desc)'!I14)","v":""}]
[{"$f":"IF('RWIS Sensor (Desc)'!A15=\"\",\"\",'RWIS Sensor (Desc)'!A15)","v":""},{"$f":"IF('RWIS Sensor (Desc)'!C15=\"\",\"\",\"2008\")","v":""},{"$f":"IF('RWIS Sensor (Desc)'!C15=\"\",\"\",'RWIS Sensor (Desc)'!C15)","v":""},{"$f":"IF('RWIS Sensor (Desc)'!E15=\"\",\"\",INDEX([1]RWIS_SENSOR_TYPE!$A$2:$A$100,MATCH('RWIS Sensor (Desc)'!$E15,[1]!MASTER_RWIS_SENSOR_TYPE_DESC[#Data],0),0))","v":""},{"$f":"IF('RWIS Sensor (Desc)'!F15=\"\",\"\",'RWIS Sensor (Desc)'!F15)","v":""},{"$f":"IF('RWIS Sensor (Desc)'!G15=\"\",\"\",INDEX([1]RWIS_SENSOR_MODEL!$B$2:$B$100,MATCH(1,([1]RWIS_SENSOR_MODEL!$C$2:$C$100='RWIS Sensor (Desc)'!$G15)*([1]RWIS_SENSOR_MODEL!$E$2:$E$100='RWIS Sensor (Code)'!$D15),0),0))","v":""},{"$f":"IF('RWIS Sensor (Desc)'!H15=\"\",\"\",INDEX([1]RWIS_SENSOR_MODEL!$A$2:$A$100,MATCH(1,([1]RWIS_SENSOR_MODEL!$C$2:$C$100='RWIS Sensor (Desc)'!$G15)*([1]RWIS_SENSOR_MODEL!$D$2:$D$100='RWIS Sensor (Desc)'!$H15)*([1]RWIS_SENSOR_MODEL!$E$2:$E$100='RWIS Sensor (Code)'!$D15),0),0))","v":""},{"$f":"IF('RWIS Sensor (Desc)'!I15=\"\",\"\",'RWIS Sensor (Desc)'!I15)","v":""}]
{"$rows_left_out":187}