{"text_format":"1","workbook":"xlsx","n_sheets":2,"sheets":["DC Power Distribution (Desc)","DC Power Distribution (Code)"],"not_rendered":{"charts":0,"images":0,"macros":1,"external_links":1,"defined_names":12,"comments":0,"pivot_tables":0},"unopened":[],"bounds":{"document_bytes":16777216,"sheet_cells":100000,"rows_first":2000,"rows_last":500,"rows_between":2000,"halvings":0,"cell_chars":16384,"cell_head_chars":4096},"cells_cut":0,"cells_raw":0,"read":"whole","date_system":"1900"}

{"sheet":"DC Power Distribution (Desc)","index":0,"n_rows":2,"n_cols":16,"rows_kept":2,"cut":false,"hidden":false,"merged":[]}
["Site Identification Name\nEquipment Cabinet SIN","Equipment Location Id ","Previous Name","Installed Date (YYYY/MM/DD)","Manufacturer ","Model ","Serial Number ","NIC Card Installed ","IP Address ","MAC Address ","Battery Pack Installed ","Input Voltage","Output Voltage(s)","Load/Draw (Amp)","Number of Rectifier Positions","Number of Breaker Positions"]
["This Field is for Reference Only\nDO NOT IMPORT","EQUIP_LOC_ID\nREQUIRED FIELD","This Field is for Reference Only\nDO NOT IMPORT","DATE_INSTALLED","ELEC_MANUF_CD ","ELEC_MODEL_CD ","SERIAL_NUMBER","NIC_CARD_IND_CD \nREQUIRED FIELD","IP_ADDRESS","MAC_ADDRESS","BATTERY_PACK_IND_CD\nREQUIRED FIELD","DEV_INPUT_VOLTAGE_CD ","DEV_OUTPUT_VOLTAGE_CD ","DCPDS_LOAD_DRAW ","RECTIFIER _POSITION ","BREAKER_POSITION "]

{"sheet":"DC Power Distribution (Code)","index":1,"n_rows":202,"n_cols":16,"rows_kept":202,"cut":false,"hidden":false,"merged":[]}
["Structure Entity Cd","Equipment Location Id ","Installed Date (YYYY/MM/DD)","Manufacturer ","Model ","Serial Number ","NIC Card Installed ","IP Address ","MAC Address ","Battery Pack Installed ","Input Voltage","Output Voltage(s)","Load/Draw (Amp)","Number of Rectifier Positions","Number of Breaker Positions","Electrical Equipment Type"]
["ENTITY_ID      REQUIRED FIELD","EQUIP_LOC_ID  REQUIRED FIELD","DATE_INSTALLED","ELEC_MANUF_CD ","ELEC_MODEL_CD ","SERIAL_NUMBER","NIC_CARD_IND_CD REQUIRED FIELD","IP_ADDRESS","MAC_ADDRESS","BATTERY_PACK_IND_CD REQUIRED FIELD","DEV_INPUT_VOLTAGE_CD ","DEV_OUTPUT_VOLTAGE_CD ","DCPDS_LOAD_DRAW ","RECTIFIER _POSITION ","BREAKER_POSITION ","ELEC_DEV_TYPE_CD"]
[{"$f":"IF('DC Power Distribution (Desc)'!B3=\"\",\"\",2029)","v":""},{"$f":"IF('DC Power Distribution (Desc)'!B3=\"\",\"\",'DC Power Distribution (Desc)'!B3)","v":""},{"$f":"IF('DC Power Distribution (Desc)'!D3=\"\",\"\",'DC Power Distribution (Desc)'!D3)","v":""},{"$f":"IF('DC Power Distribution (Desc)'!E3=\"\",\"\",INDEX([1]ELECTRIC_DEV_MANUF!$A$2:$A$1500,MATCH(1,([1]ELECTRIC_DEV_MANUF!$B$2:$B$1500='DC Power Distribution (Desc)'!$E3)*([1]ELECTRIC_DEV_MANUF!$D$2:$D$1500=\"DCPWRDIS\"),0),0))","v":""},{"$f":"IF('DC Power Distribution (Desc)'!F3=\"\",\"\",INDEX([1]ELECTRIC_DEV_MODEL!$A$2:$A$1500,MATCH(1,([1]ELECTRIC_DEV_MODEL!$C$2:$C$1500='DC Power Distribution (Desc)'!$E3)*([1]ELECTRIC_DEV_MODEL!$D$2:$D$1500='DC Power Distribution (Desc)'!$F3)*([1]ELECTRIC_DEV_MODEL!$F$2:$F$1500=\"DCPWRDIS\"),0),0))","v":""},{"$f":"IF('DC Power Distribution (Desc)'!G3=\"\",\"\",'DC Power Distribution (Desc)'!G3)","v":""},{"$f":"IF('DC Power Distribution (Desc)'!H3=\"\",\"\",INDEX([1]YES_NO!$A$2:$A$100,MATCH('DC Power Distribution (Desc)'!$H3,[1]!MASTER_YES_NO_DESC[#Data],0),0))","v":""},{"$f":"IF('DC Power Distribution (Desc)'!I3=\"\",\"\",'DC Power Distribution (Desc)'!I3)","v":""},{"$f":"IF('DC Power Distribution (Desc)'!J3=\"\",\"\",'DC Power Distribution (Desc)'!J3)","v":""},{"$f":"IF('DC Power Distribution (Desc)'!K3=\"\",\"\",INDEX([1]YES_NO!$A$2:$A$100,MATCH('DC Power Distribution (Desc)'!$K3,[1]!MASTER_YES_NO_DESC[#Data],0),0))","v":""},{"$f":"IF('DC Power Distribution (Desc)'!L3=\"\",\"\",INDEX([1]DEV_INPUT_VOLTAGE!$A$2:$A$100,MATCH('DC Power Distribution (Desc)'!$L3,[1]!MASTER_DEV_INPUT_VOLTAGE_DESC[#Data],0),0))","v":""},{"$f":"IF('DC Power Distribution (Desc)'!M3=\"\",\"\",INDEX([1]DEV_OUTPUT_VOLTAGE!$A$2:$A$100,MATCH('DC Power Distribution (Desc)'!$M3,[1]!MASTER_DEV_INPUT_VOLTAGE_DESC[#Data],0),0))","v":""},{"$f":"IF('DC Power Distribution (Desc)'!N3=\"\",\"\",'DC Power Distribution (Desc)'!N3)","v":""},{"$f":"IF('DC Power Distribution (Desc)'!O3=\"\",\"\",'DC Power Distribution (Desc)'!O3)","v":""},{"$f":"IF('DC Power Distribution (Desc)'!P3=\"\",\"\",'DC Power Distribution (Desc)'!P3)","v":""},{"$f":"IF('DC Power Distribution (Desc)'!B3=\"\",\"\",\"NA\")","v":""}]
[{"$f":"IF('DC Power Distribution (Desc)'!B4=\"\",\"\",2029)","v":""},{"$f":"IF('DC Power Distribution (Desc)'!B4=\"\",\"\",'DC Power Distribution (Desc)'!B4)","v":""},{"$f":"IF('DC Power Distribution (Desc)'!D4=\"\",\"\",'DC Power Distribution (Desc)'!D4)","v":""},{"$f":"IF('DC Power Distribution (Desc)'!E4=\"\",\"\",INDEX([1]ELECTRIC_DEV_MANUF!$A$2:$A$1500,MATCH(1,([1]ELECTRIC_DEV_MANUF!$B$2:$B$1500='DC Power Distribution (Desc)'!$E4)*([1]ELECTRIC_DEV_MANUF!$D$2:$D$1500=\"DCPWRDIS\"),0),0))","v":""},{"$f":"IF('DC Power Distribution (Desc)'!F4=\"\",\"\",INDEX([1]ELECTRIC_DEV_MODEL!$A$2:$A$1500,MATCH(1,([1]ELECTRIC_DEV_MODEL!$C$2:$C$1500='DC Power Distribution (Desc)'!$E4)*([1]ELECTRIC_DEV_MODEL!$D$2:$D$1500='DC Power Distribution (Desc)'!$F4)*([1]ELECTRIC_DEV_MODEL!$F$2:$F$1500=\"DCPWRDIS\"),0),0))","v":""},{"$f":"IF('DC Power Distribution (Desc)'!G4=\"\",\"\",'DC Power Distribution (Desc)'!G4)","v":""},{"$f":"IF('DC Power Distribution (Desc)'!H4=\"\",\"\",INDEX([1]YES_NO!$A$2:$A$100,MATCH('DC Power Distribution (Desc)'!$H4,[1]!MASTER_YES_NO_DESC[#Data],0),0))","v":""},{"$f":"IF('DC Power Distribution (Desc)'!I4=\"\",\"\",'DC Power Distribution (Desc)'!I4)","v":""},{"$f":"IF('DC Power Distribution (Desc)'!J4=\"\",\"\",'DC Power Distribution (Desc)'!J4)","v":""},{"$f":"IF('DC Power Distribution (Desc)'!K4=\"\",\"\",INDEX([1]YES_NO!$A$2:$A$100,MATCH('DC Power Distribution (Desc)'!$K4,[1]!MASTER_YES_NO_DESC[#Data],0),0))","v":""},{"$f":"IF('DC Power Distribution (Desc)'!L4=\"\",\"\",INDEX([1]DEV_INPUT_VOLTAGE!$A$2:$A$100,MATCH('DC Power Distribution (Desc)'!$L4,[1]!MASTER_DEV_INPUT_VOLTAGE_DESC[#Data],0),0))","v":""},{"$f":"IF('DC Power Distribution (Desc)'!M4=\"\",\"\",INDEX([1]DEV_OUTPUT_VOLTAGE!$A$2:$A$100,MATCH('DC Power Distribution (Desc)'!$M4,[1]!MASTER_DEV_INPUT_VOLTAGE_DESC[#Data],0),0))","v":""},{"$f":"IF('DC Power Distribution (Desc)'!N4=\"\",\"\",'DC Power Distribution (Desc)'!N4)","v":""},{"$f":"IF('DC Power Distribution (Desc)'!O4=\"\",\"\",'DC Power Distribution (Desc)'!O4)","v":""},{"$f":"IF('DC Power Distribution (Desc)'!P4=\"\",\"\",'DC Power Distribution (Desc)'!P4)","v":""},{"$f":"IF('DC Power Distribution (Desc)'!B4=\"\",\"\",\"NA\")","v":""}]
[{"$f":"IF('DC Power Distribution (Desc)'!B5=\"\",\"\",2029)","v":""},{"$f":"IF('DC Power Distribution (Desc)'!B5=\"\",\"\",'DC Power Distribution (Desc)'!B5)","v":""},{"$f":"IF('DC Power Distribution (Desc)'!D5=\"\",\"\",'DC Power Distribution (Desc)'!D5)","v":""},{"$f":"IF('DC Power Distribution (Desc)'!E5=\"\",\"\",INDEX([1]ELECTRIC_DEV_MANUF!$A$2:$A$1500,MATCH(1,([1]ELECTRIC_DEV_MANUF!$B$2:$B$1500='DC Power Distribution (Desc)'!$E5)*([1]ELECTRIC_DEV_MANUF!$D$2:$D$1500=\"DCPWRDIS\"),0),0))","v":""},{"$f":"IF('DC Power Distribution (Desc)'!F5=\"\",\"\",INDEX([1]ELECTRIC_DEV_MODEL!$A$2:$A$1500,MATCH(1,([1]ELECTRIC_DEV_MODEL!$C$2:$C$1500='DC Power Distribution (Desc)'!$E5)*([1]ELECTRIC_DEV_MODEL!$D$2:$D$1500='DC Power Distribution (Desc)'!$F5)*([1]ELECTRIC_DEV_MODEL!$F$2:$F$1500=\"DCPWRDIS\"),0),0))","v":""},{"$f":"IF('DC Power Distribution (Desc)'!G5=\"\",\"\",'DC Power Distribution (Desc)'!G5)","v":""},{"$f":"IF('DC Power Distribution (Desc)'!H5=\"\",\"\",INDEX([1]YES_NO!$A$2:$A$100,MATCH('DC Power Distribution (Desc)'!$H5,[1]!MASTER_YES_NO_DESC[#Data],0),0))","v":""},{"$f":"IF('DC Power Distribution (Desc)'!I5=\"\",\"\",'DC Power Distribution (Desc)'!I5)","v":""},{"$f":"IF('DC Power Distribution (Desc)'!J5=\"\",\"\",'DC Power Distribution (Desc)'!J5)","v":""},{"$f":"IF('DC Power Distribution (Desc)'!K5=\"\",\"\",INDEX([1]YES_NO!$A$2:$A$100,MATCH('DC Power Distribution (Desc)'!$K5,[1]!MASTER_YES_NO_DESC[#Data],0),0))","v":""},{"$f":"IF('DC Power Distribution (Desc)'!L5=\"\",\"\",INDEX([1]DEV_INPUT_VOLTAGE!$A$2:$A$100,MATCH('DC Power Distribution (Desc)'!$L5,[1]!MASTER_DEV_INPUT_VOLTAGE_DESC[#Data],0),0))","v":""},{"$f":"IF('DC Power Distribution (Desc)'!M5=\"\",\"\",INDEX([1]DEV_OUTPUT_VOLTAGE!$A$2:$A$100,MATCH('DC Power Distribution (Desc)'!$M5,[1]!MASTER_DEV_INPUT_VOLTAGE_DESC[#Data],0),0))","v":""},{"$f":"IF('DC Power Distribution (Desc)'!N5=\"\",\"\",'DC Power Distribution (Desc)'!N5)","v":""},{"$f":"IF('DC Power Distribution (Desc)'!O5=\"\",\"\",'DC Power Distribution (Desc)'!O5)","v":""},{"$f":"IF('DC Power Distribution (Desc)'!P5=\"\",\"\",'DC Power Distribution (Desc)'!P5)","v":""},{"$f":"IF('DC Power Distribution (Desc)'!B5=\"\",\"\",\"NA\")","v":""}]
[{"$f":"IF('DC Power Distribution (Desc)'!B6=\"\",\"\",2029)","v":""},{"$f":"IF('DC Power Distribution (Desc)'!B6=\"\",\"\",'DC Power Distribution (Desc)'!B6)","v":""},{"$f":"IF('DC Power Distribution (Desc)'!D6=\"\",\"\",'DC Power Distribution (Desc)'!D6)","v":""},{"$f":"IF('DC Power Distribution (Desc)'!E6=\"\",\"\",INDEX([1]ELECTRIC_DEV_MANUF!$A$2:$A$1500,MATCH(1,([1]ELECTRIC_DEV_MANUF!$B$2:$B$1500='DC Power Distribution (Desc)'!$E6)*([1]ELECTRIC_DEV_MANUF!$D$2:$D$1500=\"DCPWRDIS\"),0),0))","v":""},{"$f":"IF('DC Power Distribution (Desc)'!F6=\"\",\"\",INDEX([1]ELECTRIC_DEV_MODEL!$A$2:$A$1500,MATCH(1,([1]ELECTRIC_DEV_MODEL!$C$2:$C$1500='DC Power Distribution (Desc)'!$E6)*([1]ELECTRIC_DEV_MODEL!$D$2:$D$1500='DC Power Distribution (Desc)'!$F6)*([1]ELECTRIC_DEV_MODEL!$F$2:$F$1500=\"DCPWRDIS\"),0),0))","v":""},{"$f":"IF('DC Power Distribution (Desc)'!G6=\"\",\"\",'DC Power Distribution (Desc)'!G6)","v":""},{"$f":"IF('DC Power Distribution (Desc)'!H6=\"\",\"\",INDEX([1]YES_NO!$A$2:$A$100,MATCH('DC Power Distribution (Desc)'!$H6,[1]!MASTER_YES_NO_DESC[#Data],0),0))","v":""},{"$f":"IF('DC Power Distribution (Desc)'!I6=\"\",\"\",'DC Power Distribution (Desc)'!I6)","v":""},{"$f":"IF('DC Power Distribution (Desc)'!J6=\"\",\"\",'DC Power Distribution (Desc)'!J6)","v":""},{"$f":"IF('DC Power Distribution (Desc)'!K6=\"\",\"\",INDEX([1]YES_NO!$A$2:$A$100,MATCH('DC Power Distribution (Desc)'!$K6,[1]!MASTER_YES_NO_DESC[#Data],0),0))","v":""},{"$f":"IF('DC Power Distribution (Desc)'!L6=\"\",\"\",INDEX([1]DEV_INPUT_VOLTAGE!$A$2:$A$100,MATCH('DC Power Distribution (Desc)'!$L6,[1]!MASTER_DEV_INPUT_VOLTAGE_DESC[#Data],0),0))","v":""},{"$f":"IF('DC Power Distribution (Desc)'!M6=\"\",\"\",INDEX([1]DEV_OUTPUT_VOLTAGE!$A$2:$A$100,MATCH('DC Power Distribution (Desc)'!$M6,[1]!MASTER_DEV_INPUT_VOLTAGE_DESC[#Data],0),0))","v":""},{"$f":"IF('DC Power Distribution (Desc)'!N6=\"\",\"\",'DC Power Distribution (Desc)'!N6)","v":""},{"$f":"IF('DC Power Distribution (Desc)'!O6=\"\",\"\",'DC Power Distribution (Desc)'!O6)","v":""},{"$f":"IF('DC Power Distribution (Desc)'!P6=\"\",\"\",'DC Power Distribution (Desc)'!P6)","v":""},{"$f":"IF('DC Power Distribution (Desc)'!B6=\"\",\"\",\"NA\")","v":""}]
[{"$f":"IF('DC Power Distribution (Desc)'!B7=\"\",\"\",2029)","v":""},{"$f":"IF('DC Power Distribution (Desc)'!B7=\"\",\"\",'DC Power Distribution (Desc)'!B7)","v":""},{"$f":"IF('DC Power Distribution (Desc)'!D7=\"\",\"\",'DC Power Distribution (Desc)'!D7)","v":""},{"$f":"IF('DC Power Distribution (Desc)'!E7=\"\",\"\",INDEX([1]ELECTRIC_DEV_MANUF!$A$2:$A$1500,MATCH(1,([1]ELECTRIC_DEV_MANUF!$B$2:$B$1500='DC Power Distribution (Desc)'!$E7)*([1]ELECTRIC_DEV_MANUF!$D$2:$D$1500=\"DCPWRDIS\"),0),0))","v":""},{"$f":"IF('DC Power Distribution (Desc)'!F7=\"\",\"\",INDEX([1]ELECTRIC_DEV_MODEL!$A$2:$A$1500,MATCH(1,([1]ELECTRIC_DEV_MODEL!$C$2:$C$1500='DC Power Distribution (Desc)'!$E7)*([1]ELECTRIC_DEV_MODEL!$D$2:$D$1500='DC Power Distribution (Desc)'!$F7)*([1]ELECTRIC_DEV_MODEL!$F$2:$F$1500=\"DCPWRDIS\"),0),0))","v":""},{"$f":"IF('DC Power Distribution (Desc)'!G7=\"\",\"\",'DC Power Distribution (Desc)'!G7)","v":""},{"$f":"IF('DC Power Distribution (Desc)'!H7=\"\",\"\",INDEX([1]YES_NO!$A$2:$A$100,MATCH('DC Power Distribution (Desc)'!$H7,[1]!MASTER_YES_NO_DESC[#Data],0),0))","v":""},{"$f":"IF('DC Power Distribution (Desc)'!I7=\"\",\"\",'DC Power Distribution (Desc)'!I7)","v":""},{"$f":"IF('DC Power Distribution (Desc)'!J7=\"\",\"\",'DC Power Distribution (Desc)'!J7)","v":""},{"$f":"IF('DC Power Distribution (Desc)'!K7=\"\",\"\",INDEX([1]YES_NO!$A$2:$A$100,MATCH('DC Power Distribution (Desc)'!$K7,[1]!MASTER_YES_NO_DESC[#Data],0),0))","v":""},{"$f":"IF('DC Power Distribution (Desc)'!L7=\"\",\"\",INDEX([1]DEV_INPUT_VOLTAGE!$A$2:$A$100,MATCH('DC Power Distribution (Desc)'!$L7,[1]!MASTER_DEV_INPUT_VOLTAGE_DESC[#Data],0),0))","v":""},{"$f":"IF('DC Power Distribution (Desc)'!M7=\"\",\"\",INDEX([1]DEV_OUTPUT_VOLTAGE!$A$2:$A$100,MATCH('DC Power Distribution (Desc)'!$M7,[1]!MASTER_DEV_INPUT_VOLTAGE_DESC[#Data],0),0))","v":""},{"$f":"IF('DC Power Distribution (Desc)'!N7=\"\",\"\",'DC Power Distribution (Desc)'!N7)","v":""},{"$f":"IF('DC Power Distribution (Desc)'!O7=\"\",\"\",'DC Power Distribution (Desc)'!O7)","v":""},{"$f":"IF('DC Power Distribution (Desc)'!P7=\"\",\"\",'DC Power Distribution (Desc)'!P7)","v":""},{"$f":"IF('DC Power Distribution (Desc)'!B7=\"\",\"\",\"NA\")","v":""}]
[{"$f":"IF('DC Power Distribution (Desc)'!B8=\"\",\"\",2029)","v":""},{"$f":"IF('DC Power Distribution (Desc)'!B8=\"\",\"\",'DC Power Distribution (Desc)'!B8)","v":""},{"$f":"IF('DC Power Distribution (Desc)'!D8=\"\",\"\",'DC Power Distribution (Desc)'!D8)","v":""},{"$f":"IF('DC Power Distribution (Desc)'!E8=\"\",\"\",INDEX([1]ELECTRIC_DEV_MANUF!$A$2:$A$1500,MATCH(1,([1]ELECTRIC_DEV_MANUF!$B$2:$B$1500='DC Power Distribution (Desc)'!$E8)*([1]ELECTRIC_DEV_MANUF!$D$2:$D$1500=\"DCPWRDIS\"),0),0))","v":""},{"$f":"IF('DC Power Distribution (Desc)'!F8=\"\",\"\",INDEX([1]ELECTRIC_DEV_MODEL!$A$2:$A$1500,MATCH(1,([1]ELECTRIC_DEV_MODEL!$C$2:$C$1500='DC Power Distribution (Desc)'!$E8)*([1]ELECTRIC_DEV_MODEL!$D$2:$D$1500='DC Power Distribution (Desc)'!$F8)*([1]ELECTRIC_DEV_MODEL!$F$2:$F$1500=\"DCPWRDIS\"),0),0))","v":""},{"$f":"IF('DC Power Distribution (Desc)'!G8=\"\",\"\",'DC Power Distribution (Desc)'!G8)","v":""},{"$f":"IF('DC Power Distribution (Desc)'!H8=\"\",\"\",INDEX([1]YES_NO!$A$2:$A$100,MATCH('DC Power Distribution (Desc)'!$H8,[1]!MASTER_YES_NO_DESC[#Data],0),0))","v":""},{"$f":"IF('DC Power Distribution (Desc)'!I8=\"\",\"\",'DC Power Distribution (Desc)'!I8)","v":""},{"$f":"IF('DC Power Distribution (Desc)'!J8=\"\",\"\",'DC Power Distribution (Desc)'!J8)","v":""},{"$f":"IF('DC Power Distribution (Desc)'!K8=\"\",\"\",INDEX([1]YES_NO!$A$2:$A$100,MATCH('DC Power Distribution (Desc)'!$K8,[1]!MASTER_YES_NO_DESC[#Data],0),0))","v":""},{"$f":"IF('DC Power Distribution (Desc)'!L8=\"\",\"\",INDEX([1]DEV_INPUT_VOLTAGE!$A$2:$A$100,MATCH('DC Power Distribution (Desc)'!$L8,[1]!MASTER_DEV_INPUT_VOLTAGE_DESC[#Data],0),0))","v":""},{"$f":"IF('DC Power Distribution (Desc)'!M8=\"\",\"\",INDEX([1]DEV_OUTPUT_VOLTAGE!$A$2:$A$100,MATCH('DC Power Distribution (Desc)'!$M8,[1]!MASTER_DEV_INPUT_VOLTAGE_DESC[#Data],0),0))","v":""},{"$f":"IF('DC Power Distribution (Desc)'!N8=\"\",\"\",'DC Power Distribution (Desc)'!N8)","v":""},{"$f":"IF('DC Power Distribution (Desc)'!O8=\"\",\"\",'DC Power Distribution (Desc)'!O8)","v":""},{"$f":"IF('DC Power Distribution (Desc)'!P8=\"\",\"\",'DC Power Distribution (Desc)'!P8)","v":""},{"$f":"IF('DC Power Distribution (Desc)'!B8=\"\",\"\",\"NA\")","v":""}]
[{"$f":"IF('DC Power Distribution (Desc)'!B9=\"\",\"\",2029)","v":""},{"$f":"IF('DC Power Distribution (Desc)'!B9=\"\",\"\",'DC Power Distribution (Desc)'!B9)","v":""},{"$f":"IF('DC Power Distribution (Desc)'!D9=\"\",\"\",'DC Power Distribution (Desc)'!D9)","v":""},{"$f":"IF('DC Power Distribution (Desc)'!E9=\"\",\"\",INDEX([1]ELECTRIC_DEV_MANUF!$A$2:$A$1500,MATCH(1,([1]ELECTRIC_DEV_MANUF!$B$2:$B$1500='DC Power Distribution (Desc)'!$E9)*([1]ELECTRIC_DEV_MANUF!$D$2:$D$1500=\"DCPWRDIS\"),0),0))","v":""},{"$f":"IF('DC Power Distribution (Desc)'!F9=\"\",\"\",INDEX([1]ELECTRIC_DEV_MODEL!$A$2:$A$1500,MATCH(1,([1]ELECTRIC_DEV_MODEL!$C$2:$C$1500='DC Power Distribution (Desc)'!$E9)*([1]ELECTRIC_DEV_MODEL!$D$2:$D$1500='DC Power Distribution (Desc)'!$F9)*([1]ELECTRIC_DEV_MODEL!$F$2:$F$1500=\"DCPWRDIS\"),0),0))","v":""},{"$f":"IF('DC Power Distribution (Desc)'!G9=\"\",\"\",'DC Power Distribution (Desc)'!G9)","v":""},{"$f":"IF('DC Power Distribution (Desc)'!H9=\"\",\"\",INDEX([1]YES_NO!$A$2:$A$100,MATCH('DC Power Distribution (Desc)'!$H9,[1]!MASTER_YES_NO_DESC[#Data],0),0))","v":""},{"$f":"IF('DC Power Distribution (Desc)'!I9=\"\",\"\",'DC Power Distribution (Desc)'!I9)","v":""},{"$f":"IF('DC Power Distribution (Desc)'!J9=\"\",\"\",'DC Power Distribution (Desc)'!J9)","v":""},{"$f":"IF('DC Power Distribution (Desc)'!K9=\"\",\"\",INDEX([1]YES_NO!$A$2:$A$100,MATCH('DC Power Distribution (Desc)'!$K9,[1]!MASTER_YES_NO_DESC[#Data],0),0))","v":""},{"$f":"IF('DC Power Distribution (Desc)'!L9=\"\",\"\",INDEX([1]DEV_INPUT_VOLTAGE!$A$2:$A$100,MATCH('DC Power Distribution (Desc)'!$L9,[1]!MASTER_DEV_INPUT_VOLTAGE_DESC[#Data],0),0))","v":""},{"$f":"IF('DC Power Distribution (Desc)'!M9=\"\",\"\",INDEX([1]DEV_OUTPUT_VOLTAGE!$A$2:$A$100,MATCH('DC Power Distribution (Desc)'!$M9,[1]!MASTER_DEV_INPUT_VOLTAGE_DESC[#Data],0),0))","v":""},{"$f":"IF('DC Power Distribution (Desc)'!N9=\"\",\"\",'DC Power Distribution (Desc)'!N9)","v":""},{"$f":"IF('DC Power Distribution (Desc)'!O9=\"\",\"\",'DC Power Distribution (Desc)'!O9)","v":""},{"$f":"IF('DC Power Distribution (Desc)'!P9=\"\",\"\",'DC Power Distribution (Desc)'!P9)","v":""},{"$f":"IF('DC Power Distribution (Desc)'!B9=\"\",\"\",\"NA\")","v":""}]
[{"$f":"IF('DC Power Distribution (Desc)'!B10=\"\",\"\",2029)","v":""},{"$f":"IF('DC Power Distribution (Desc)'!B10=\"\",\"\",'DC Power Distribution (Desc)'!B10)","v":""},{"$f":"IF('DC Power Distribution (Desc)'!D10=\"\",\"\",'DC Power Distribution (Desc)'!D10)","v":""},{"$f":"IF('DC Power Distribution (Desc)'!E10=\"\",\"\",INDEX([1]ELECTRIC_DEV_MANUF!$A$2:$A$1500,MATCH(1,([1]ELECTRIC_DEV_MANUF!$B$2:$B$1500='DC Power Distribution (Desc)'!$E10)*([1]ELECTRIC_DEV_MANUF!$D$2:$D$1500=\"DCPWRDIS\"),0),0))","v":""},{"$f":"IF('DC Power Distribution (Desc)'!F10=\"\",\"\",INDEX([1]ELECTRIC_DEV_MODEL!$A$2:$A$1500,MATCH(1,([1]ELECTRIC_DEV_MODEL!$C$2:$C$1500='DC Power Distribution (Desc)'!$E10)*([1]ELECTRIC_DEV_MODEL!$D$2:$D$1500='DC Power Distribution (Desc)'!$F10)*([1]ELECTRIC_DEV_MODEL!$F$2:$F$1500=\"DCPWRDIS\"),0),0))","v":""},{"$f":"IF('DC Power Distribution (Desc)'!G10=\"\",\"\",'DC Power Distribution (Desc)'!G10)","v":""},{"$f":"IF('DC Power Distribution (Desc)'!H10=\"\",\"\",INDEX([1]YES_NO!$A$2:$A$100,MATCH('DC Power Distribution (Desc)'!$H10,[1]!MASTER_YES_NO_DESC[#Data],0),0))","v":""},{"$f":"IF('DC Power Distribution (Desc)'!I10=\"\",\"\",'DC Power Distribution (Desc)'!I10)","v":""},{"$f":"IF('DC Power Distribution (Desc)'!J10=\"\",\"\",'DC Power Distribution (Desc)'!J10)","v":""},{"$f":"IF('DC Power Distribution (Desc)'!K10=\"\",\"\",INDEX([1]YES_NO!$A$2:$A$100,MATCH('DC Power Distribution (Desc)'!$K10,[1]!MASTER_YES_NO_DESC[#Data],0),0))","v":""},{"$f":"IF('DC Power Distribution (Desc)'!L10=\"\",\"\",INDEX([1]DEV_INPUT_VOLTAGE!$A$2:$A$100,MATCH('DC Power Distribution (Desc)'!$L10,[1]!MASTER_DEV_INPUT_VOLTAGE_DESC[#Data],0),0))","v":""},{"$f":"IF('DC Power Distribution (Desc)'!M10=\"\",\"\",INDEX([1]DEV_OUTPUT_VOLTAGE!$A$2:$A$100,MATCH('DC Power Distribution (Desc)'!$M10,[1]!MASTER_DEV_INPUT_VOLTAGE_DESC[#Data],0),0))","v":""},{"$f":"IF('DC Power Distribution (Desc)'!N10=\"\",\"\",'DC Power Distribution (Desc)'!N10)","v":""},{"$f":"IF('DC Power Distribution (Desc)'!O10=\"\",\"\",'DC Power Distribution (Desc)'!O10)","v":""},{"$f":"IF('DC Power Distribution (Desc)'!P10=\"\",\"\",'DC Power Distribution (Desc)'!P10)","v":""},{"$f":"IF('DC Power Distribution (Desc)'!B10=\"\",\"\",\"NA\")","v":""}]
{"$rows_left_out":192}