{"text_format":"1","workbook":"xlsx","n_sheets":12,"sheets":["Welcome","Introduction","Main","Input Freeway Segments","Input Ramp Segments","Input Ramp Terminals","Output Summary","Output Freeway Segments","Output Ramp Segments","Output Ramp Terminals","Calibration Factors","Temp"],"not_rendered":{"charts":0,"images":34,"macros":1,"external_links":0,"defined_names":0,"comments":5,"pivot_tables":0},"unopened":[],"bounds":{"document_bytes":16777216,"sheet_cells":100000,"rows_first":2000,"rows_last":500,"rows_between":2000,"halvings":0,"cell_chars":16384,"cell_head_chars":4096},"cells_cut":0,"cells_raw":0,"read":"whole","date_system":"1900"}

{"sheet":"Welcome","index":0,"n_rows":18,"n_cols":7,"rows_kept":18,"cut":false,"hidden":false,"merged":[[2,2,2,11],[11,1,13,12],[7,1,9,12],[32,1,34,12],[17,1,19,12],[22,1,23,12],[25,1,30,12]]}
[]
[]
[null,null,"HSM Methodology for Chapters 18 and 19"]
[]
[]
[null,null,null,null,null,null,"Build 06.10 - Modified to Include Present Worth Analysis"]
[null,"FOREWORD"]
[null,"This software can be used to evaluate the relationship between various highway design configurations and the expected average crash frequency.  The profession's understanding of the influence of geometric design and traffic control features on safety is an evolving process.  As additional information becomes available, this software will be updated to include the latest findings."]
[]
[]
[]
[null,"The \"Introduction\" worksheet provides useful information about this software.  This information should be read prior to first use of the software.  The Introduction worksheet can be selected from the tabs at the bottom of the screen.   After reading the Introduction, the other worksheets can be used to evaluate a freeway facility."]
[]
[]
[]
[]
[null,"DISCLAIMER"]
[null,"This computational engine is offered as is, without warranty or promise of support of any kind either expressed or implied. "]

{"sheet":"Introduction","index":1,"n_rows":589,"n_cols":10,"rows_kept":589,"cut":false,"hidden":false,"merged":[[588,1,589,12],[346,1,349,6],[490,1,492,12],[494,1,500,12],[353,8,355,12],[535,1,540,12],[560,1,564,12],[585,1,586,12],[357,8,361,12],[2,2,2,11],[6,1,9,12],[11,1,12,12],[14,1,18,12],[61,1,63,12],[27,1,28,12],[35,1,37,12],[93,1,94,12],[87,1,90,12],[96,1,97,12],[101,1,102,12],[104,1,106,12],[133,1,135,12],[138,1,141,12],[143,1,149,12],[127,1,130,12],[265,1,269,12],[313,1,316,12],[370,8,376,12],[363,8,368,12],[170,1,171,12],[287,1,289,12],[173,1,175,12],[226,1,229,12],[247,1,248,12],[178,1,181,12],[200,1,205,12],[318,1,323,12],[327,1,331,6],[333,1,337,6],[324,1,324,12]]}
[]
[]
[null,null,"INTRODUCTION"]
[]
[]
[null,"PREFACE"]
[null,"This software provides information about the relationship between geometric design features and safety.  It is based on research that quantified the relationship between various design elements (e.g., lane width) or design components (e.g., left-turn bay) and average crash frequency.  The information provided in this software is intended to help designers make informed judgments about the safety performance of design alternatives.  "]
[]
[]
[]
[]
[null,"This software does not define design controls and does not represent a design requirement.  It is not a substitute for engineering judgment.  Further, it does not represent a legal requirement for roadway design."]
[]
[]
[null,"As discussed in the Highway Safety Manual, analysts should be aware that variability in crash data is so large that crash counts averaged over only a few years may not reveal telling information about the true average crash frequency at a given site.  This large variability, combined with the subtle influence that most geometric features have on safety, can make it difficult to observe the safety effect of a change in geometry in the year or two following the change.  In many cases, the change must be implemented at many sites and monitored for several years before its true effect on safety can be detected using crash data."]
[]
[]
[]
[]
[]
[null,"EVALUATION SCOPE"]
[null,"This software can be used to evaluate the following basic freeway and interchange components:"]
[]
[null,"● Freeway sections (with or without speed-change lanes)."]
[null,"● Ramps or collector-distributor (C-D) roads."]
[null,"● Crossroad ramp terminals."]
[]
[null,"It can also be used to evaluate combinations of components, as may exist along a freeway section or in the vicinity of an interchange. Examples include:"]
[]
[]
[null,"● A freeway section comprised of several consecutive freeway segments."]
[null,"● A freeway section within an interchange area with one or more freeway speed-change lanes."]
[null,"● An interchange ramp comprised of one or more segments."]
[null,"● An interchange consisting of one or more ramps and related ramp terminals."]
[]
[null,"This software can be used to evaluate freeways and interchanges in urban and rural areas. It cannot be used to evaluate crossroad segments at an interchange.  If the crossroad needs to be evaluated, then one of the following Part C methods in the Highway Safety Manual may be used for this purpose (as determined by the area type and crossroad cross section):"]
[]
[]
[]
[null,"● Chapter 10 - Predictive Method for Rural Two-Lane Roads."]
[null,"● Chapter 11 - Predictive Method for Rural Multilane Highways."]
[null,"● Chapter 12 - Predictive Method for Urban and Suburban Arterials."]
[]
[null,"WORKSHEET SELECTION"]
[null,"This software includes the following worksheets:"]
[]
[null,"● Welcome ",null,null,"Includes a foreword, acknowledgements, and disclaimer."]
[null,"● Introduction",null,null,"Brief overview of this software."]
[null,"● Main ",null,null,"Input data to describe evaluation and start calculations."]
[null,"● Input Freeway Segments ",null,null,"Input data describing freeway segments and speed-change lanes."]
[null,"● Input Ramp Segments ",null,null,"Input data describing ramp and C-D road segments."]
[null,"● Input Ramp Terminals",null,null,"Input data describing crossroad ramp terminals."]
[null,"● Output Summary",null,null,"Summary of analysis results."]
[null,"● Output Freeway Segments",null,null,"Detailed listing of analysis results for freeway segments and speed-change lanes."]
[null,"● Output Ramp Segments",null,null,"Detailed listing of analysis results for ramp and C-D road segments."]
[null,"● Output Ramp Terminals",null,null,"Detailed listing of analysis results for crossroad ramp terminals."]
[null,"● Calibration Factors",null,null,"Calibration factors for predictive models and crash type distributions."]
[]
[null,">>> Always proceed to the Main worksheet to start the evaluation process. <<<"]
[]
[null,"USER'S GUIDE"]
[null,"Each spreadsheet is designed in a consistent manner and their use is similar.  The cells with a blue background are for user input.   Most of the other cells are locked to prevent inadvertent changes to cell contents.  A sample portion of the Main worksheet and the Input Freeway Segments worksheet is shown below. "]
[]
[]
[]
[null,"Main Worksheet"]
[]
[]
[]
[]
[]
[]
[]
[]
[]
[]
[]
[]
[]
[]
[null,null,null,"Place cursor over the red corner to obtain",null,null,null,null,"Drop-down list.  Click on grey square"]
[null,null,null,"a pop-up message with useful information.",null,null,null,null,"to show list. Click on input choice."]
[]
[null,"General Information"]
[null,"The analyst can enter any descriptive information about the location being analyzed.  Use the blue cells to enter this data."]
[]
[null,"Crash Data Description"]
[null,"Indicate whether crash data will be input.  If input, these data will provide a more reliable estimate of the expected crash frequency. The crash data can be provided for each site, or for the collective set of sites (i.e., for the entire project).  Of these two options, providing crash data for each site will provide a more reliable estimate of the expected crash frequency. "]
[]
[]
[]
[]
[null,"Study Period and Crash Period"]
[null,"All evaluations must have a specified study period.  This period represents the consecutive years for which an estimate of the crash frequency is desired.  It can represent past years, the current year, or some future years.  "]
[]
[]
[null,"The Study Period is defined by the \"First year of analysis\" and the \"Last year of analysis.\"  Input data (i.e., geometric design and traffic data) will need to be provided to describe conditions during the study period."]
[]
[]
[null,"The Crash Period is optional.  It is used if crash data are provided."]
[]
[null,"The Crash Period is defined by the \"First year of crash data\" and the \"Last year of crash data.\"  Input data (i.e., geometric design and traffic data) will need to be provided to describe conditions during the crash period."]
[]
[]
[null,"Note that if crash data are provided, then input data are needed for BOTH the study period and the crash period.  These periods may or may not represent the same time period.  Typically, the crash period is for some number of past years and the study period is for some number of future years."]
[]
[]
[]
[null,"Input Freeway Segment Worksheet",null,null,null,null,null,null,"Click on a button to execute macro code."]
[]
[]
[]
[]
[]
[]
[]
[]
[]
[]
[]
[]
[]
[]
[]
[null,null,null,null,null,null,null,null,null,"Drop-down list.  Click on grey square"]
[null,null,null,null,null,null,null,null,null,"to show list. Click on input choice."]
[]
[null,"Data entry in this worksheet (and the Input Ramp Segments and Input Ramp Terminals worksheets) should proceed from top to bottom. That is, it should proceed in the direction of increasing row number.  Worksheet macro code monitors each input value and adjusts the color of the cells in the rows below (i.e., it identifies the appropriate input cells by changing their background color to blue and eliminates the unneeded input cells by changing their background color to white)."]
[]
[]
[]
[]
[null,"Basic Roadway Data"]
[null,"Enter a value, or make a selection in a drop-down list, for each input variable.  Use the blue cells to enter this data. If the value entered is not within range, then a message is displayed indicating \"Out of Range!\". Re-enter a value that is within the indicated range."]
[]
[]
[]
[null,"Alignment Data"]
[null,"Data entry is the same as for Basic Roadway Data.  If an input value suggests the need for additional input, then additional cells in the same column may be converted to blue and require an input value.  Similarly, if an input value suggests that some input cells are not relevant, then these cells will be converted to white.  Only data in blue cells will be used in the analysis.  Data must be provided for all blue cells (unless stated otherwise)."]
[]
[]
[]
[]
[null,"In the \"Input Worksheet for Freeway Segments\" graphic shown above, the row labeled \"Horizontal curve in segment?\" shows \"No\" for segment 1.  This response indicates that segment 1 does not have a curve on it during the crash period or the study period.  As a result, the rows labeled \"Curve radius\", \"Length of curve\", and \"Length of curve in segment\" have cells that are white (i.e., no curve so no curve data needed).  In contrast, segment 2 has a curve on on both roadbeds of the divided freeway so \"Both Dir.\" is input.  As a result, the subsequent three cells are converted to blue and curve data are input.  Note that the curve radius is 2,500 ft for the crash period and 3,500 ft for the study period.  In this instance, the crash data correspond to a period of time where the curve radius was 2,500 ft but the agency is investigating the safety benefit of curve flattening on this segment."]
[]
[]
[]
[]
[]
[]
[]
[null,"Traffic Data"]
[]
[]
[]
[]
[]
[]
[]
[]
[]
[]
[]
[]
[]
[]
[]
[]
[]
[]
[null,"AADT volume must be provided for one year in either the crash period or study period. Desirably, AADT volume is provided for each year of interest. The cells associated with the crash period and the study period have a blue background."]
[]
[]
[null,"In the graphic above, the crash period is for years 2005 to 2007 and the study period is for years 2013 to 2015.  If the AADT volume is unknown for one or more years, then the corresponding blue cell is left blank by the analyst. The missing AADT volumes are estimated using the rules described in Section C.5 in Part C of the Highway Safety Manual."]
[]
[]
[]
[null,"Output Freeway Segments"]
[null,"The output worksheet is divided into several sections. The first section lists the computed CMF values. The next section lists the estimated crash frequency, categorized by fatal-and-injury and property-damage-only crash severity categories. The next section lists the crash severity distribution. The next section lists some intermediate calculations and the last section lists the AADT values used in the calculations (including those values that were estimated because of missing AADT data)."]
[]
[]
[]
[]
[null,"Crash Modification Factors"]
[]
[]
[]
[]
[]
[]
[]
[]
[]
[]
[]
[]
[]
[]
[]
[]
[null,"This section summarizes the CMFs computed using the equations described in the Project 17-45 Final Report. Each CMF is associated with one geometric design or traffic control feature. Its value is 1.0 when the feature’s characteristics are the same as those used to define the base condition for the predictive model. The CMF value will be less than 1.0 if (1) the characteristics of associated feature are different from those of the base condition and (2) the sites that have this variation of the feature experience fewer crashes than otherwise similar sites but with feature characteristics consistent with base conditions.  The Highway Safety Manual provides additional discussion of CMFs."]
[]
[]
[]
[]
[]
[]
[null,"Fatal-and-Injury Crash Frequency"]
[]
[]
[]
[]
[]
[]
[]
[]
[]
[]
[]
[]
[]
[]
[]
[]
[]
[]
[null,"The expected average crash frequency for the freeway segment equals the sum of the expected multiple-vehicle-, single-vehicle-, ramp-entrance-, and ramp-exit-related crashes.  It is an estimate of the long-run frequency of crashes for the segment.  The expected fatal-and-injury crash frequency and the expected property-damage-only crash frequency are separately computed and summarized in the output worksheet. "]
[]
[]
[]
[]
[null,"Crash Severity Distribution"]
[]
[]
[]
[]
[]
[]
[]
[]
[]
[]
[]
[]
[]
[]
[]
[null,"This section provides the severity distribution of crashes for each segment.  The distribution for all segments combined is provided in the Output Summary worksheet."]
[]
[]
[null,"Calibration Factors"]
[null,"Crash Frequency Models"]
[]
[]
[]
[]
[]
[]
[]
[]
[]
[]
[]
[]
[]
[null,"This section of the spreadsheet is intended for analysts that desire to adjust the predictive models to better match conditions in their jurisdiction.  The calibration factors and default model coefficients provided (in yellow shaded cells) are representative of several states.  The calibration factors should be used to calibrate the models to local conditions. Changes to the model coefficients should be made with care, and based on sound statistical modeling. "]
[]
[]
[]
[]
[]
[null,"Crash Distribution"]
[]
[]
[]
[]
[]
[]
[]
[]
[]
[]
[]
[]
[]
[]
[]
[null,"Default values are provided for the distribution of crashes by area type, crash type, and crash type category.  The values shown are representative of roadways on the state highway system in several states.  Other values can be used, if desired, to tailor the estimates to local conditions."]
[]
[]
[]
[null,"FREEWAY SPEED-CHANGE LANE LOCATION"]
[]
[]
[]
[]
[]
[]
[]
[]
[]
[]
[]
[]
[]
[]
[]
[]
[]
[]
[]
[]
[]
[null,"The entrance ramp speed-change lane is considered to coincide with the ramp entrance length (shown in the graphic above) and include all lanes associated with the freeway and ramp for a common travel direction. Similarly, the exit ramp speed-change lane is considered to coincide with the ramp exit length (shown above) and include all lanes associated with the freeway and ramp for a common travel direction. "]
[]
[]
[]
[]
[null,"By applying the aforementioned definition, a speed-change-related crash is identified as a crash that is located between the taper point and the gore point and on the same side of the roadway as the ramp. This definition is likely to identify all speed-change-related crashes, but it may also identify some freeway crashes that are not associated with the speed-change lane. For this reason, some factors that influence crash frequency on freeway segments (e.g., lane width) may also influence crashes in the speed-change lane."]
[]
[]
[]
[]
[]
[null,"Note that a typical weaving section does not have a speed-change lane at either of its ends. "]
[]
[null,"WEAVING LENGTH AND TYPE"]
[null,"The weaving section geometry has some influence on safety.  Three types are defined in the 2000 Highway Capacity Manual.  Type B has unique features and is specifically addressed in the safety predictive method. Typical Type B weaving sections are shown in the graphic to the right. "]
[]
[]
[]
[]
[]
[null,"The length of the weaving section has an important influence on the operation and safety of the freeway segment. This influence relates to the degree to which the weaving activity is concentrated along the freeway. The convention used to measure this length is shown in the graphic below."]
[]
[]
[]
[]
[]
[]
[]
[]
[]
[]
[]
[]
[null,"The length of the weaving section on a collector-distributor road is measured using the same convention as for freeway weaving sections.  The graphic above shows the convention used to measure weaving section length on collector-distributor roads."]
[]
[]
[]
[]
[null,"RAMP CURVE LOCATION"]
[]
[null,null,null,null,null,null,null,null,"Curves are located along the ramp or collector-distributor road using a linear referencing system. The beginning of the ramp is designated as ramp-mile 0.0."]
[]
[]
[]
[null,null,null,null,null,null,null,null,"The gore point will often be used to define ramp-mile 0.0 for a ramp or C-D road. The gore point is located where the pair of solid white pavement edge markings that separate the ramp from the intersecting roadway are 2.0 ft apart. "]
[]
[]
[]
[]
[]
[null,null,null,null,null,null,null,null,"For exit ramps and C-D roads that diverge from the freeway (and entrance ramps that diverge from the crossroad using a speed-change lane), ramp-mile 0.0 is located where the gore point projects onto the ramp reference line. The ramp reference line is defined as the right edge of the ramp traveled way."]
[]
[]
[]
[]
[]
[]
[null,null,null,null,null,null,null,null,"For entrance ramps that intersect the crossroad, ramp-mile 0.0 is located where the ramp reference line intersects with the near edge of traveled way of the crossroad. The location of the ramp-mile 0.0 is shown in the graphic to the left."]
[]
[]
[]
[]
[]
[]
[]
[]
[null,"RAMP TERMINALS"]
[null,"Ramp Terminal Configurations"]
[]
[]
[]
[]
[]
[]
[]
[]
[]
[]
[]
[]
[]
[]
[]
[]
[]
[]
[]
[]
[]
[]
[]
[]
[]
[]
[]
[]
[]
[]
[]
[]
[]
[]
[]
[]
[]
[]
[]
[]
[]
[]
[]
[]
[]
[]
[]
[]
[]
[]
[]
[]
[]
[]
[]
[]
[]
[]
[]
[]
[]
[]
[]
[]
[]
[]
[]
[]
[]
[]
[]
[]
[]
[]
[]
[]
[]
[]
[]
[]
[]
[]
[]
[]
[]
[]
[]
[]
[]
[null,"Ramp Terminal Boundaries"]
[]
[]
[]
[]
[]
[]
[]
[]
[]
[]
[]
[]
[]
[]
[]
[]
[]
[]
[]
[null,"The graphic above illustrates two crossroad ramp terminals with the D4 configuration. Each terminal represents a separate site. The two terminals are shown in the context of a diamond interchange. The arrangement shown is intended to illustrate the ramp terminal boundaries used for safety evaluation–it is not necessarily typical ramp terminal geometry. "]
[]
[]
[]
[null,"The free-flow loop ramp associated with the four-quadrant parclos (i.e., the A4 and B4 configurations) is not considered to be part of the nearby ramp terminal. All subsequent discussions where “ramp AADT” is identified for these two configurations are referring to the AADT of the diagonal entrance ramp or the AADT of the diagonal exit ramp. With one exception, the loop ramp of the A4 and B4 configuration is not explicitly addressed by the ramp terminal models. The exception is the right-turn channelization that serves traffic entering the loop ramp at the A4 configuration. It can be part of the ramp terminal design and its associated crashes are addressed by the predictive models."]
[]
[]
[]
[]
[]
[]
[null,"Number of Lanes for Exit Ramps (nex)"]
[]
[]
[]
[]
[]
[]
[]
[]
[]
[]
[]
[]
[]
[]
[]
[]
[]
[]
[]
[]
[]
[]
[]
[]
[]
[]
[]
[]
[]
[]
[]
[]
[]
[null,"The number of lanes serving the exit ramp (nex) is based on the count of lanes taken at the last point where all exiting movements are joined (i.e., at the channelization gore point if right-turn channelization is provided). All lanes counted need to be fully developed for 100 ft or more upstream from the point at which their respective movement intersects with the crossroad. The lane (or lanes) associated with the loop exit ramp at a B4 terminal configuration are not included in this count. The graphic above illustrates the application of this guidance."]
[]
[]
[]
[]
[]
[null,"Skew Angle"]
[]
[]
[]
[]
[]
[]
[]
[]
[]
[]
[]
[]
[]
[]
[]
[]
[]
[]
[null,"Skew angle is measured for the exit ramp.  At a B4 terminal configuration, the skew angle represents that for the diagonal exit ramp (not the loop exit ramp). Skew angle is the acute angle between the crossroad centerline and a line along the center an imaginary vehicle stopped at the end of the exit ramp (i.e., where it joins the crossroad).  The vehicle is centered in the traveled way.  If vehicles can exit the ramp as left- or right-turn movements, then use a left-turning vehicle as the vehicle of reference. The skew angle is 0.0 degrees if the two reference lines intersect at 90 degrees."]
[]
[]
[]
[]
[]
[null,"Median Width and Turn Bay Width"]
[]
[]
[]
[]
[]
[]
[]
[]
[]
[]
[]
[]
[]
[]
[]
[]
[]
[]
[null,"The crossroad median width at an intersection is measured between the near edges of the traveled way associated with the opposing through traffic streams. It includes the width of the left shoulder and any left-turn lanes that are present. "]
[]
[]
[null,"The left-turn bay width is measured from the near edge of the traveled way of the adjacent through lane to the lane marking (or curb face) that delineates the median."]

{"sheet":"Main","index":2,"n_rows":30,"n_cols":38,"rows_kept":30,"cut":false,"hidden":false,"merged":[[24,1,25,11],[5,10,5,11],[2,1,2,11],[4,3,4,11],[5,3,5,4],[5,6,5,7]]}
[]
[]
[null,"HSM Methodology for Chapters 18 and19",null,null,null,null,null,null,null,null,null,null,null,null,null,null,null,null,null,null,null,null,null,null,null,null,null,null,"Freeway",null,null,null,"Ramp",null,null,null,"Ramp"]
[null,"General Information",null,null,null,null,null,null,null,null,null,null,null,null,null,null,null,null,null,null,null,null,null,null,null,null,null,null,"Segments",null,null,null,"Segments",null,null,null,"Terminals"]
[null,"Project description:",null,"Sample Data",null,null,null,null,null,null,null,null,null,null,null,null,null,null,null,null,null,null,null,null,null,null,"First year:",null,{"$f":"MIN($D7, AC7)","v":2005},null,null,null,{"$f":"MIN($D7, AG7)","v":2005},null,null,null,{"$f":"MIN($D7, AK7)","v":2005}]
[null,"Analyst:",null,"JAB",null,"Date:",{"$f":"NOW()","v":"2023-03-08T07:17:04.850"},null,"Area type:",null,"Urban",null,null,null,null,null,null,null,null,null,null,null,null,null,null,null,"Last year:",null,{"$f":"MAX($D8,AC8)","v":2015},null,null,null,{"$f":"MAX($D8,AG8)","v":2015},null,null,null,{"$f":"MAX($D8,AK8)","v":2015}]
[null,"First year of analysis:",null,2013,null,null,null,null,null,null,null,null,null,null,null,null,null,null,null,null,null,null,null,null,null,null,"First crash data year:",null,{"$f":"AD7","v":2005},2005,null,null,{"$f":"AH7","v":2005},2005,null,null,{"$f":"AL7","v":2005},2005]
[null,"Last year of analysis:",null,2015,{"$f":"IF(D8<D7, \"Note: must equal or exceed first year of analysis.\", IF(D8-MIN(AC5,AG5,AK5)+1>24, \"Note: last year must be less than or equal to \"&TEXT(MIN(AC5,AG5,AK5)+24-1,\"0\"),\".\"))","v":"."},null,null,null,null,null,null,null,null,null,null,null,null,null,null,null,null,null,null,null,null,null,"Last crash data year:",null,{"$f":"MIN($D$8, AD8, AC7+4,YEAR(NOW()))","v":2007},2007,null,null,{"$f":"MIN($D$8, AH8, AG7+4,YEAR(NOW()))","v":2007},2007,null,null,{"$f":"MIN($D$8, AL8, AK7+4,YEAR(NOW()))","v":2007},2007]
[null,"Crash Data Description"]
[null,"Freeway segments",null,null,null,null,{"$f":"IF(L11-I11>4, \"Upper limit of 5 years of crash data.\", \".\")","v":"."},null,null,null,null,null,null,null,null,null,null,null,null,null,null,null,null,null,null,null,"Freeway Segments",null,null,null,"Ramp Segments",null,null,null,"Ramp Terminals"]
[null,null,null,null,null,null,"First year of crash data:",null,2005,"Last year of crash data:",null,2007,null,null,null,null,null,null,null,null,null,null,null,null,null,null,"No crash data",null,"Data for each individual segment",null,"No crash data",null,"Data for each individual segment",null,"No crash data",null,"Data for each individual terminal"]
[null,"Ramp segments",null,null,null,null,{"$f":"IF(L13-I13>4, \"Upper limit of 5 years of crash data.\", \".\")","v":"."},null,null,null,null,null,null,null,null,null,null,null,null,null,null,null,null,null,null,null,"Data for all segments combined",null,null,null,"Data for all segments combined",null,null,null,"Data for all terminals combined"]
[null,null,null,null,null,null,"First year of crash data:",null,2005,"Last year of crash data:",null,2007,null,null,null,null,null,null,null,null,null,null,null,null,null,null,"Data for each individual segment",null,null,null,"Data for each individual segment",null,null,null,"Data for each individual terminal"]
[null,"Ramp terminals",null,null,null,null,{"$f":"IF(L15-I15>4, \"Upper limit of 5 years of crash data.\", \".\")","v":"."},null,null,null,null,null,null,null,null,null,null,null,null,null,null,null,null,null,null,null,null,"Data?",{"$f":"IF(AC11=AA11, FALSE, TRUE)","v":true},null,null,null,{"$f":"IF(AG11=AE11, FALSE, TRUE)","v":true},null,null,null,{"$f":"IF(AK11=AI11, FALSE, TRUE)","v":true}]
[null,null,null,null,null,null,"First year of crash data:",null,2005,"Last year of crash data:",null,2007,null,null,null,null,null,null,null,null,null,null,null,null,null,null,null,"Project?",{"$f":"IF(AC11=AA12,TRUE,FALSE)","v":false},null,null,null,{"$f":"IF(AG11=AE12,TRUE,FALSE)","v":false},null,null,null,{"$f":"IF(AK11=AI12,TRUE,FALSE)","v":false}]
[]
[]
[null,"Program Control"]
[null,"1. Enter data in the Main, Input Freeway Segments, Input Ramp Segments, Input Ramp Terminals worksheets."]
[null,"2. Click Perform Calculations button to start calculation process."]
[]
[]
[]
[null,"3. Review results in the Output Summary worksheet. Optionally, click the Print buttons to print the summary worksheets."]
[null,"4. Optionally, detailed results can be reviewed in the Output Freeway Segments, Output Ramp Segments, Output Ramp Terminals worksheets."]
[]
[]
[]
[null,"Warning Messages",null,"     See note"]
[null,"Freeway Segments",null,null,"Ramp Segments",null,null,"Ramp Terminals"]

{"sheet":"Input Freeway Segments","index":3,"n_rows":331,"n_cols":87,"rows_kept":331,"cut":false,"hidden":false,"merged":[[4,67,5,67],[4,18,5,18],[4,19,5,19],[4,20,5,20],[4,21,5,21],[4,22,5,22],[4,23,5,23],[4,12,5,12],[4,13,5,13],[4,14,5,14],[4,15,5,15],[4,16,5,16],[4,17,5,17],[4,10,5,10],[4,11,5,11],[4,6,5,6],[4,7,5,7],[4,8,5,8],[4,9,5,9],[4,36,5,36],[4,37,5,37],[4,38,5,38],[4,39,5,39],[4,44,5,44],[4,45,5,45],[4,40,5,40],[4,41,5,41],[4,42,5,42],[4,43,5,43],[4,30,5,30],[4,31,5,31],[4,32,5,32],[97,6,97,7],[4,51,5,51],[4,52,5,52],[4,53,5,53],[4,54,5,54],[4,47,5,47],[4,48,5,48],[4,49,5,49],[4,50,5,50],[4,59,5,59],[4,60,5,60],[4,61,5,61],[4,62,5,62],[4,55,5,55],[4,56,5,56],[4,57,5,57],[4,58,5,58],[4,33,5,33],[4,34,5,34],[4,35,5,35],[4,24,5,24],[4,25,5,25],[4,26,5,26],[4,27,5,27],[4,28,5,28],[4,29,5,29],[93,6,93,7],[93,8,93,9],[93,10,93,11],[93,12,93,13],[101,8,101,9],[4,68,5,68],[4,69,5,69],[4,70,5,70],[4,63,5,63],[4,64,5,64],[4,65,5,65],[4,66,5,66],[4,86,5,86],[4,79,5,79],[4,80,5,80],[4,81,5,81],[4,82,5,82],[4,73,5,73],[4,74,5,74],[218,5,219,5],[4,83,5,83],[4,84,5,84],[4,85,5,85],[4,75,5,75],[4,76,5,76],[4,77,5,77],[4,78,5,78],[4,71,5,71],[4,72,5,72],[98,6,98,7],[99,6,99,7],[100,6,100,7],[101,6,101,7],[94,6,94,7],[95,6,95,7],[96,6,96,7],[115,8,115,9],[116,8,116,9],[117,8,117,9],[110,8,110,9],[111,8,111,9],[112,8,112,9],[113,8,113,9],[106,6,106,7],[107,6,107,7],[108,6,108,7],[109,6,109,7],[102,6,102,7],[103,6,103,7],[104,6,104,7],[105,6,105,7],[114,6,114,7],[115,6,115,7],[116,6,116,7],[117,6,117,7],[110,6,110,7],[111,6,111,7],[112,6,112,7],[113,6,113,7],[99,10,99,11],[100,10,100,11],[101,10,101,11],[94,10,94,11],[95,10,95,11],[96,10,96,11],[97,10,97,11],[106,10,106,11],[107,10,107,11],[108,10,108,11],[109,10,109,11],[102,10,102,11],[103,10,103,11],[104,10,104,11],[105,10,105,11],[114,10,114,11],[94,8,94,9],[95,8,95,9],[96,8,96,9],[97,8,97,9],[106,8,106,9],[107,8,107,9],[108,8,108,9],[109,8,109,9],[102,8,102,9],[103,8,103,9],[104,8,104,9],[105,8,105,9],[114,8,114,9],[98,8,98,9],[99,8,99,9],[100,8,100,9],[115,10,115,11],[116,10,116,11],[117,10,117,11],[110,10,110,11],[111,10,111,11],[112,10,112,11],[113,10,113,11],[98,12,98,13],[99,12,99,13],[100,12,100,13],[101,12,101,13],[94,12,94,13],[95,12,95,13],[96,12,96,13],[97,12,97,13],[106,12,106,13],[107,12,107,13],[108,12,108,13],[109,12,109,13],[102,12,102,13],[103,12,103,13],[104,12,104,13],[105,12,105,13],[114,12,114,13],[115,12,115,13],[116,12,116,13],[117,12,117,13],[110,12,110,13],[111,12,111,13],[112,12,112,13],[113,12,113,13],[98,10,98,11],[116,14,116,15],[117,14,117,15],[110,14,110,15],[111,14,111,15],[112,14,112,15],[113,14,113,15],[98,16,98,17],[99,16,99,17],[100,16,100,17],[101,16,101,17],[94,16,94,17],[95,16,95,17],[96,16,96,17],[97,16,97,17],[106,16,106,17],[107,16,107,17],[108,16,108,17],[109,16,109,17],[102,16,102,17],[103,16,103,17],[104,16,104,17],[105,16,105,17],[114,16,114,17],[115,16,115,17],[116,16,116,17],[117,16,117,17],[110,16,110,17],[111,16,111,17],[112,16,112,17],[113,16,113,17],[98,14,98,15],[99,14,99,15],[99,18,99,19],[100,18,100,19],[101,18,101,19],[94,18,94,19],[95,18,95,19],[96,18,96,19],[97,18,97,19],[106,18,106,19],[107,18,107,19],[108,18,108,19],[109,18,109,19],[102,18,102,19],[103,18,103,19],[104,18,104,19],[105,18,105,19],[114,18,114,19],[115,14,115,15],[100,14,100,15],[101,14,101,15],[94,14,94,15],[95,14,95,15],[96,14,96,15],[97,14,97,15],[106,14,106,15],[107,14,107,15],[108,14,108,15],[109,14,109,15],[102,14,102,15],[103,14,103,15],[104,14,104,15],[105,14,105,15],[114,14,114,15],[115,18,115,19],[116,18,116,19],[117,18,117,19],[110,18,110,19],[111,18,111,19],[112,18,112,19],[113,18,113,19],[98,20,98,21],[99,20,99,21],[100,20,100,21],[101,20,101,21],[94,20,94,21],[95,20,95,21],[96,20,96,21],[97,20,97,21],[106,20,106,21],[107,20,107,21],[108,20,108,21],[109,20,109,21],[102,20,102,21],[103,20,103,21],[104,20,104,21],[105,20,105,21],[114,20,114,21],[115,20,115,21],[116,20,116,21],[117,20,117,21],[110,20,110,21],[111,20,111,21],[112,20,112,21],[113,20,113,21],[98,18,98,19],[116,22,116,23],[117,22,117,23],[110,22,110,23],[111,22,111,23],[112,22,112,23],[113,22,113,23],[98,24,98,25],[99,24,99,25],[100,24,100,25],[101,24,101,25],[94,24,94,25],[95,24,95,25],[96,24,96,25],[97,24,97,25],[106,24,106,25],[107,24,107,25],[108,24,108,25],[109,24,109,25],[102,24,102,25],[103,24,103,25],[104,24,104,25],[105,24,105,25],[114,24,114,25],[115,24,115,25],[116,24,116,25],[117,24,117,25],[110,24,110,25],[111,24,111,25],[112,24,112,25],[113,24,113,25],[98,22,98,23],[99,22,99,23],[99,26,99,27],[100,26,100,27],[101,26,101,27],[94,26,94,27],[95,26,95,27],[96,26,96,27],[97,26,97,27],[106,26,106,27],[107,26,107,27],[108,26,108,27],[109,26,109,27],[102,26,102,27],[103,26,103,27],[104,26,104,27],[105,26,105,27],[114,26,114,27],[115,22,115,23],[100,22,100,23],[101,22,101,23],[94,22,94,23],[95,22,95,23],[96,22,96,23],[97,22,97,23],[106,22,106,23],[107,22,107,23],[108,22,108,23],[109,22,109,23],[102,22,102,23],[103,22,103,23],[104,22,104,23],[105,22,105,23],[114,22,114,23],[115,26,115,27],[116,26,116,27],[117,26,117,27],[110,26,110,27],[111,26,111,27],[112,26,112,27],[113,26,113,27],[98,28,98,29],[99,28,99,29],[100,28,100,29],[101,28,101,29],[94,28,94,29],[95,28,95,29],[96,28,96,29],[97,28,97,29],[106,28,106,29],[107,28,107,29],[108,28,108,29],[109,28,109,29],[102,28,102,29],[103,28,103,29],[104,28,104,29],[105,28,105,29],[114,28,114,29],[115,28,115,29],[116,28,116,29],[117,28,117,29],[110,28,110,29],[111,28,111,29],[112,28,112,29],[113,28,113,29],[98,26,98,27],[116,30,116,31],[117,30,117,31],[110,30,110,31],[111,30,111,31],[112,30,112,31],[113,30,113,31],[98,32,98,33],[99,32,99,33],[100,32,100,33],[101,32,101,33],[94,32,94,33],[95,32,95,33],[96,32,96,33],[97,32,97,33],[106,32,106,33],[107,32,107,33],[108,32,108,33],[109,32,109,33],[102,32,102,33],[103,32,103,33],[104,32,104,33],[105,32,105,33],[114,32,114,33],[115,32,115,33],[116,32,116,33],[117,32,117,33],[110,32,110,33],[111,32,111,33],[112,32,112,33],[113,32,113,33],[98,30,98,31],[99,30,99,31],[99,34,99,35],[100,34,100,35],[101,34,101,35],[94,34,94,35],[95,34,95,35],[96,34,96,35],[97,34,97,35],[106,34,106,35],[107,34,107,35],[108,34,108,35],[109,34,109,35],[102,34,102,35],[103,34,103,35],[104,34,104,35],[105,34,105,35],[114,34,114,35],[115,30,115,31],[100,30,100,31],[101,30,101,31],[94,30,94,31],[95,30,95,31],[96,30,96,31],[97,30,97,31],[106,30,106,31],[107,30,107,31],[108,30,108,31],[109,30,109,31],[102,30,102,31],[103,30,103,31],[104,30,104,31],[105,30,105,31],[114,30,114,31],[115,34,115,35],[116,34,116,35],[117,34,117,35],[110,34,110,35],[111,34,111,35],[112,34,112,35],[113,34,113,35],[98,36,98,37],[99,36,99,37],[100,36,100,37],[101,36,101,37],[94,36,94,37],[95,36,95,37],[96,36,96,37],[97,36,97,37],[106,36,106,37],[107,36,107,37],[108,36,108,37],[109,36,109,37],[102,36,102,37],[103,36,103,37],[104,36,104,37],[105,36,105,37],[114,36,114,37],[115,36,115,37],[116,36,116,37],[117,36,117,37],[110,36,110,37],[111,36,111,37],[112,36,112,37],[113,36,113,37],[98,34,98,35],[116,38,116,39],[117,38,117,39],[110,38,110,39],[111,38,111,39],[112,38,112,39],[113,38,113,39],[98,40,98,41],[99,40,99,41],[100,40,100,41],[101,40,101,41],[94,40,94,41],[95,40,95,41],[96,40,96,41],[97,40,97,41],[106,40,106,41],[107,40,107,41],[108,40,108,41],[109,40,109,41],[102,40,102,41],[103,40,103,41],[104,40,104,41],[105,40,105,41],[114,40,114,41],[115,40,115,41],[116,40,116,41],[117,40,117,41],[110,40,110,41],[111,40,111,41],[112,40,112,41],[113,40,113,41],[98,38,98,39],[99,38,99,39],[99,42,99,43],[100,42,100,43],[101,42,101,43],[94,42,94,43],[95,42,95,43],[96,42,96,43],[97,42,97,43],[106,42,106,43],[107,42,107,43],[108,42,108,43],[109,42,109,43],[102,42,102,43],[103,42,103,43],[104,42,104,43],[105,42,105,43],[114,42,114,43],[115,38,115,39],[100,38,100,39],[101,38,101,39],[94,38,94,39],[95,38,95,39],[96,38,96,39],[97,38,97,39],[106,38,106,39],[107,38,107,39],[108,38,108,39],[109,38,109,39],[102,38,102,39],[103,38,103,39],[104,38,104,39],[105,38,105,39],[114,38,114,39],[115,42,115,43],[116,42,116,43],[117,42,117,43],[110,42,110,43],[111,42,111,43],[112,42,112,43],[113,42,113,43],[98,44,98,45],[99,44,99,45],[100,44,100,45],[101,44,101,45],[94,44,94,45],[95,44,95,45],[96,44,96,45],[97,44,97,45],[106,44,106,45],[107,44,107,45],[108,44,108,45],[109,44,109,45],[102,44,102,45],[103,44,103,45],[104,44,104,45],[105,44,105,45],[114,44,114,45],[115,44,115,45],[116,44,116,45],[117,44,117,45],[110,44,110,45],[111,44,111,45],[112,44,112,45],[113,44,113,45],[98,42,98,43],[141,6,141,7],[142,6,142,7],[135,6,135,7],[136,6,136,7],[137,6,137,7],[138,6,138,7],[123,8,123,9],[124,8,124,9],[125,8,125,9],[126,8,126,9],[119,8,119,9],[120,8,120,9],[121,8,121,9],[122,8,122,9],[131,8,131,9],[132,8,132,9],[133,8,133,9],[134,8,134,9],[127,8,127,9],[128,8,128,9],[129,8,129,9],[130,8,130,9],[139,8,139,9],[140,8,140,9],[141,8,141,9],[142,8,142,9],[135,8,135,9],[136,8,136,9],[137,8,137,9],[138,8,138,9],[123,6,123,7],[124,6,124,7],[124,10,124,11],[125,10,125,11],[126,10,126,11],[119,10,119,11],[120,10,120,11],[121,10,121,11],[122,10,122,11],[131,10,131,11],[132,10,132,11],[133,10,133,11],[134,10,134,11],[127,10,127,11],[128,10,128,11],[129,10,129,11],[130,10,130,11],[139,10,139,11],[140,6,140,7],[125,6,125,7],[126,6,126,7],[119,6,119,7],[120,6,120,7],[121,6,121,7],[122,6,122,7],[131,6,131,7],[132,6,132,7],[133,6,133,7],[134,6,134,7],[127,6,127,7],[128,6,128,7],[129,6,129,7],[130,6,130,7],[139,6,139,7],[140,10,140,11],[141,10,141,11],[142,10,142,11],[135,10,135,11],[136,10,136,11],[137,10,137,11],[138,10,138,11],[123,12,123,13],[124,12,124,13],[125,12,125,13],[126,12,126,13],[119,12,119,13],[120,12,120,13],[121,12,121,13],[122,12,122,13],[131,12,131,13],[132,12,132,13],[133,12,133,13],[134,12,134,13],[127,12,127,13],[128,12,128,13],[129,12,129,13],[130,12,130,13],[139,12,139,13],[140,12,140,13],[141,12,141,13],[142,12,142,13],[135,12,135,13],[136,12,136,13],[137,12,137,13],[138,12,138,13],[123,10,123,11],[141,14,141,15],[142,14,142,15],[135,14,135,15],[136,14,136,15],[137,14,137,15],[138,14,138,15],[123,16,123,17],[124,16,124,17],[125,16,125,17],[126,16,126,17],[119,16,119,17],[120,16,120,17],[121,16,121,17],[122,16,122,17],[131,16,131,17],[132,16,132,17],[133,16,133,17],[134,16,134,17],[127,16,127,17],[128,16,128,17],[129,16,129,17],[130,16,130,17],[139,16,139,17],[140,16,140,17],[141,16,141,17],[142,16,142,17],[135,16,135,17],[136,16,136,17],[137,16,137,17],[138,16,138,17],[123,14,123,15],[124,14,124,15],[124,18,124,19],[125,18,125,19],[126,18,126,19],[119,18,119,19],[120,18,120,19],[121,18,121,19],[122,18,122,19],[131,18,131,19],[132,18,132,19],[133,18,133,19],[134,18,134,19],[127,18,127,19],[128,18,128,19],[129,18,129,19],[130,18,130,19],[139,18,139,19],[140,14,140,15],[125,14,125,15],[126,14,126,15],[119,14,119,15],[120,14,120,15],[121,14,121,15],[122,14,122,15],[131,14,131,15],[132,14,132,15],[133,14,133,15],[134,14,134,15],[127,14,127,15],[128,14,128,15],[129,14,129,15],[130,14,130,15],[139,14,139,15],[140,18,140,19],[141,18,141,19],[142,18,142,19],[135,18,135,19],[136,18,136,19],[137,18,137,19],[138,18,138,19],[123,20,123,21],[124,20,124,21],[125,20,125,21],[126,20,126,21],[119,20,119,21],[120,20,120,21],[121,20,121,21],[122,20,122,21],[131,20,131,21],[132,20,132,21],[133,20,133,21],[134,20,134,21],[127,20,127,21],[128,20,128,21],[129,20,129,21],[130,20,130,21],[139,20,139,21],[140,20,140,21],[141,20,141,21],[142,20,142,21],[135,20,135,21],[136,20,136,21],[137,20,137,21],[138,20,138,21],[123,18,123,19],[141,22,141,23],[142,22,142,23],[135,22,135,23],[136,22,136,23],[137,22,137,23],[138,22,138,23],[123,24,123,25],[124,24,124,25],[125,24,125,25],[126,24,126,25],[119,24,119,25],[120,24,120,25],[121,24,121,25],[122,24,122,25],[131,24,131,25],[132,24,132,25],[133,24,133,25],[134,24,134,25],[127,24,127,25],[128,24,128,25],[129,24,129,25],[130,24,130,25],[139,24,139,25],[140,24,140,25],[141,24,141,25],[142,24,142,25],[135,24,135,25],[136,24,136,25],[137,24,137,25],[138,24,138,25],[123,22,123,23],[124,22,124,23],[124,26,124,27],[125,26,125,27],[126,26,126,27],[119,26,119,27],[120,26,120,27],[121,26,121,27],[122,26,122,27],[131,26,131,27],[132,26,132,27],[133,26,133,27],[134,26,134,27],[127,26,127,27],[128,26,128,27],[129,26,129,27],[130,26,130,27],[139,26,139,27],[140,22,140,23],[125,22,125,23],[126,22,126,23],[119,22,119,23],[120,22,120,23],[121,22,121,23],[122,22,122,23],[131,22,131,23],[132,22,132,23],[133,22,133,23],[134,22,134,23],[127,22,127,23],[128,22,128,23],[129,22,129,23],[130,22,130,23],[139,22,139,23],[140,26,140,27],[141,26,141,27],[142,26,142,27],[135,26,135,27],[136,26,136,27],[137,26,137,27],[138,26,138,27],[123,28,123,29],[124,28,124,29],[125,28,125,29],[126,28,126,29],[119,28,119,29],[120,28,120,29],[121,28,121,29],[122,28,122,29],[131,28,131,29],[132,28,132,29],[133,28,133,29],[134,28,134,29],[127,28,127,29],[128,28,128,29],[129,28,129,29],[130,28,130,29],[139,28,139,29],[140,28,140,29],[141,28,141,29],[142,28,142,29],[135,28,135,29],[136,28,136,29],[137,28,137,29],[138,28,138,29],[123,26,123,27],[141,30,141,31],[142,30,142,31],[135,30,135,31],[136,30,136,31],[137,30,137,31],[138,30,138,31],[123,32,123,33],[124,32,124,33],[125,32,125,33],[126,32,126,33],[119,32,119,33],[120,32,120,33],[121,32,121,33],[122,32,122,33],[131,32,131,33],[132,32,132,33],[133,32,133,33],[134,32,134,33],[127,32,127,33],[128,32,128,33],[129,32,129,33],[130,32,130,33],[139,32,139,33],[140,32,140,33],[141,32,141,33],[142,32,142,33],[135,32,135,33],[136,32,136,33],[137,32,137,33],[138,32,138,33],[123,30,123,31],[124,30,124,31],[124,34,124,35],[125,34,125,35],[126,34,126,35],[119,34,119,35],[120,34,120,35],[121,34,121,35],[122,34,122,35],[131,34,131,35],[132,34,132,35],[133,34,133,35],[134,34,134,35],[127,34,127,35],[128,34,128,35],[129,34,129,35],[130,34,130,35],[139,34,139,35],[140,30,140,31],[125,30,125,31],[126,30,126,31],[119,30,119,31],[120,30,120,31],[121,30,121,31],[122,30,122,31],[131,30,131,31],[132,30,132,31],[133,30,133,31],[134,30,134,31],[127,30,127,31],[128,30,128,31],[129,30,129,31],[130,30,130,31],[139,30,139,31],[140,34,140,35],[141,34,141,35],[142,34,142,35],[135,34,135,35],[136,34,136,35],[137,34,137,35],[138,34,138,35],[123,36,123,37],[124,36,124,37],[125,36,125,37],[126,36,126,37],[119,36,119,37],[120,36,120,37],[121,36,121,37],[122,36,122,37],[131,36,131,37],[132,36,132,37],[133,36,133,37],[134,36,134,37],[127,36,127,37],[128,36,128,37],[129,36,129,37],[130,36,130,37],[139,36,139,37],[140,36,140,37],[141,36,141,37],[142,36,142,37],[135,36,135,37],[136,36,136,37],[137,36,137,37],[138,36,138,37],[123,34,123,35],[141,38,141,39],[142,38,142,39],[135,38,135,39],[136,38,136,39],[137,38,137,39],[138,38,138,39],[123,40,123,41],[124,40,124,41],[125,40,125,41],[126,40,126,41],[119,40,119,41],[120,40,120,41],[121,40,121,41],[122,40,122,41],[131,40,131,41],[132,40,132,41],[133,40,133,41],[134,40,134,41],[127,40,127,41],[128,40,128,41],[129,40,129,41],[130,40,130,41],[139,40,139,41],[140,40,140,41],[141,40,141,41],[142,40,142,41],[135,40,135,41],[136,40,136,41],[137,40,137,41],[138,40,138,41],[123,38,123,39],[124,38,124,39],[124,42,124,43],[125,42,125,43],[126,42,126,43],[119,42,119,43],[120,42,120,43],[121,42,121,43],[122,42,122,43],[131,42,131,43],[132,42,132,43],[133,42,133,43],[134,42,134,43],[127,42,127,43],[128,42,128,43],[129,42,129,43],[130,42,130,43],[139,42,139,43],[140,38,140,39],[125,38,125,39],[126,38,126,39]],"merged_total":2501,"flags":["merged_cut"]}
[]
[]
[null,null,null,null,"Input Worksheet for Freeway Segments"]
[null,null,null,null,null,null,{"$f":"\"Segment \"& TEXT(INT((COLUMN()-5)/2),\"0\")","v":"Segment 1"},null,{"$f":"\"Segment \"& TEXT(INT((COLUMN()-5)/2),\"0\")","v":"Segment 2"},null,{"$f":"\"Segment \"& TEXT(INT((COLUMN()-5)/2),\"0\")","v":"Segment 3"},null,{"$f":"\"Segment \"& TEXT(INT((COLUMN()-5)/2),\"0\")","v":"Segment 4"},null,{"$f":"\"Segment \"& TEXT(INT((COLUMN()-5)/2),\"0\")","v":"Segment 5"},null,{"$f":"\"Segment \"& TEXT(INT((COLUMN()-5)/2),\"0\")","v":"Segment 6"},null,{"$f":"\"Segment \"& TEXT(INT((COLUMN()-5)/2),\"0\")","v":"Segment 7"},null,{"$f":"\"Segment \"& TEXT(INT((COLUMN()-5)/2),\"0\")","v":"Segment 8"},null,{"$f":"\"Segment \"& TEXT(INT((COLUMN()-5)/2),\"0\")","v":"Segment 9"},null,{"$f":"\"Segment \"& TEXT(INT((COLUMN()-5)/2),\"0\")","v":"Segment 10"},null,{"$f":"\"Segment \"& TEXT(INT((COLUMN()-5)/2),\"0\")","v":"Segment 11"},null,{"$f":"\"Segment \"& TEXT(INT((COLUMN()-5)/2),\"0\")","v":"Segment 12"},null,{"$f":"\"Segment \"& TEXT(INT((COLUMN()-5)/2),\"0\")","v":"Segment 13"},null,{"$f":"\"Segment \"& TEXT(INT((COLUMN()-5)/2),\"0\")","v":"Segment 14"},null,{"$f":"\"Segment \"& TEXT(INT((COLUMN()-5)/2),\"0\")","v":"Segment 15"},null,{"$f":"\"Segment \"& TEXT(INT((COLUMN()-5)/2),\"0\")","v":"Segment 16"},null,{"$f":"\"Segment \"& TEXT(INT((COLUMN()-5)/2),\"0\")","v":"Segment 17"},null,{"$f":"\"Segment \"& TEXT(INT((COLUMN()-5)/2),\"0\")","v":"Segment 18"},null,{"$f":"\"Segment \"& TEXT(INT((COLUMN()-5)/2),\"0\")","v":"Segment 19"},null,{"$f":"\"Segment \"& TEXT(INT((COLUMN()-5)/2),\"0\")","v":"Segment 20"},null,null,{"$f":"G4","v":"Segment 1"},null,{"$f":"I4","v":"Segment 2"},null,{"$f":"K4","v":"Segment 3"},null,{"$f":"M4","v":"Segment 4"},null,{"$f":"O4","v":"Segment 5"},null,{"$f":"Q4","v":"Segment 6"},null,{"$f":"S4","v":"Segment 7"},null,{"$f":"U4","v":"Segment 8"},null,{"$f":"W4","v":"Segment 9"},null,{"$f":"Y4","v":"Segment 10"},null,{"$f":"AA4","v":"Segment 11"},null,{"$f":"AC4","v":"Segment 12"},null,{"$f":"AE4","v":"Segment 13"},null,{"$f":"AG4","v":"Segment 14"},null,{"$f":"AI4","v":"Segment 15"},null,{"$f":"AK4","v":"Segment 16"},null,{"$f":"AM4","v":"Segment 17"},null,{"$f":"AO4","v":"Segment 18"},null,{"$f":"AQ4","v":"Segment 19"},null,{"$f":"AS4","v":"Segment 20"}]
[null,null,null,null,null,null,{"$f":"IF(Main!$AC$14=TRUE, \"Crash Period\", \"Study Period\")","v":"Crash Period"},{"$f":"IF(Main!$AC$14=TRUE, \"Study Period\", \"\")","v":"Study Period"},{"$f":"G5","v":"Crash Period"},"Study Period","Crash Period","Study Period","Crash Period","Study Period","Crash Period","Study Period","Crash Period","Study Period","Crash Period","Study Period","Crash Period","Study Period","Crash Period","Study Period","Crash Period","Study Period","Crash Period","Study Period","Crash Period","Study Period","Crash Period","Study Period","Crash Period","Study Period","Crash Period","Study Period","Crash Period","Study Period","Crash Period","Study Period","Crash Period","Study Period","Crash Period","Study Period","Crash Period","Study Period",null,{"$f":"G5","v":"Crash Period"},{"$f":"H5","v":"Study Period"},{"$f":"I5","v":"Crash Period"},{"$f":"J5","v":"Study Period"},{"$f":"K5","v":"Crash Period"},{"$f":"L5","v":"Study Period"},{"$f":"M5","v":"Crash Period"},{"$f":"N5","v":"Study Period"},{"$f":"O5","v":"Crash Period"},{"$f":"P5","v":"Study Period"},{"$f":"Q5","v":"Crash Period"},{"$f":"R5","v":"Study Period"},{"$f":"S5","v":"Crash Period"},{"$f":"T5","v":"Study Period"},{"$f":"U5","v":"Crash Period"},{"$f":"V5","v":"Study Period"},{"$f":"W5","v":"Crash Period"},{"$f":"X5","v":"Study Period"},{"$f":"Y5","v":"Crash Period"},{"$f":"Z5","v":"Study Period"},{"$f":"AA5","v":"Crash Period"},{"$f":"AB5","v":"Study Period"},{"$f":"AC5","v":"Crash Period"},{"$f":"AD5","v":"Study Period"},{"$f":"AE5","v":"Crash Period"},{"$f":"AF5","v":"Study Period"},{"$f":"AG5","v":"Crash Period"},{"$f":"AH5","v":"Study Period"},{"$f":"AI5","v":"Crash Period"},{"$f":"AJ5","v":"Study Period"},{"$f":"AK5","v":"Crash Period"},{"$f":"AL5","v":"Study Period"},{"$f":"AM5","v":"Crash Period"},{"$f":"AN5","v":"Study Period"},{"$f":"AO5","v":"Crash Period"},{"$f":"AP5","v":"Study Period"},{"$f":"AQ5","v":"Crash Period"},{"$f":"AR5","v":"Study Period"},{"$f":"AS5","v":"Crash Period"},{"$f":"AT5","v":"Study Period"}]
[null,null,"      (View results in Column AV)","(View results in Advisory Messages)"]
[null,"Basic Roadway Data"]
[null,"Number of through lanes (n):",null,null,null,null,5,{"$f":"G8","v":5},5,{"$f":"I8","v":5},4,{"$f":"K8","v":4},4,{"$f":"M8","v":4},null,{"$f":"O8","v":0},null,{"$f":"Q8","v":0},null,{"$f":"S8","v":0},null,{"$f":"U8","v":0},null,{"$f":"W8","v":0},null,{"$f":"Y8","v":0},null,{"$f":"AA8","v":0},null,{"$f":"AC8","v":0},null,{"$f":"AE8","v":0},null,{"$f":"AG8","v":0},null,{"$f":"AI8","v":0},null,{"$f":"AK8","v":0},null,{"$f":"AM8","v":0},null,{"$f":"AO8","v":0},null,{"$f":"AQ8","v":0},null,{"$f":"AS8","v":0},null,5,5,5,5,4,4,4,4]
[null,"Freeway segment description:",null,null,null,null,"Station 0+00.00 ",null,"Station 4+75.20",null,null,"Alt seg",null,null,null,null,null,null,null,null,null,null,null,null,null,null,null,null,null,null,null,null,null,null,null,null,null,null,null,null,null,null,null,null,null,null,null,"Station 0+00.00 ",null,"Station 4+75.20",null,null,"Alt seg"]
[null,"Segment length (L), mi:",null,null,null,null,0.09,{"$f":"G10","v":0.09},0.05,{"$f":"I10","v":0.05},0.08,{"$f":"K10","v":0.08},0.25,{"$f":"M10","v":0.25},null,{"$f":"O10","v":0},null,{"$f":"Q10","v":0},null,{"$f":"S10","v":0},null,{"$f":"U10","v":0},null,{"$f":"W10","v":0},null,{"$f":"Y10","v":0},null,{"$f":"AA10","v":0},null,{"$f":"AC10","v":0},null,{"$f":"AE10","v":0},null,{"$f":"AG10","v":0},null,{"$f":"AI10","v":0},null,{"$f":"AK10","v":0},null,{"$f":"AM10","v":0},null,{"$f":"AO10","v":0},null,{"$f":"AQ10","v":0},null,{"$f":"AS10","v":0},null,9.0000003576278687E-2,9.0000003576278687E-2,5.000000074505806E-2,5.000000074505806E-2,7.9999998211860657E-2,7.9999998211860657E-2,0.25,0.25]
[null,"Alignment Data"]
[null,"Horizontal Curve Data",null,null,"    See note"]
[null,1,"Horizontal curve in segment?:",null,null,null,"No",{"$f":"G13","v":"No"},"No",{"$f":"I13","v":"No"},"No",{"$f":"K13","v":"No"},"Both Dir.",{"$f":"M13","v":"Both Dir."},null,{"$f":"O13","v":0},null,{"$f":"Q13","v":0},null,{"$f":"S13","v":0},null,{"$f":"U13","v":0},null,{"$f":"W13","v":0},null,{"$f":"Y13","v":0},null,{"$f":"AA13","v":0},null,{"$f":"AC13","v":0},null,{"$f":"AE13","v":0},null,{"$f":"AG13","v":0},null,{"$f":"AI13","v":0},null,{"$f":"AK13","v":0},null,{"$f":"AM13","v":0},null,{"$f":"AO13","v":0},null,{"$f":"AQ13","v":0},null,{"$f":"AS13","v":0},null,"No","No","No","No","No","No","Both Dir.","Both Dir."]
[null,null,"Curve radius (R1), ft:",null,null,null,null,0,null,0,null,0,2800,2800,null,0,null,0,null,0,null,0,null,0,null,0,null,0,null,0,null,0,null,0,null,0,null,0,null,0,null,0,null,0,null,0,null,0,0,0,0,0,0,2800,2800]
[null,null,"Length of curve (Lc1), mi:",null,null,null,null,0,null,0,null,0,0.23,0.23,null,0,null,0,null,0,null,0,null,0,null,0,null,0,null,0,null,0,null,0,null,0,null,0,null,0,null,0,null,0,null,0,null,0,0,0,0,0,0,0.23000000417232513,0.23000000417232513]
[null,null,"Length of curve in segment (Lc1,seg), mi:",null,null,null,null,0,null,0,null,0,0.15,0.15,null,0,null,0,null,0,null,0,null,0,null,0,null,0,null,0,null,0,null,0,null,0,null,0,null,0,null,0,null,0,null,0,null,0,0,0,0,0,0,0.15000000596046448,0.15000000596046448]
[null,2,"Horizontal curve in segment?:",null,null,null,"No","No","No","No","No","No","No","No",null,0,null,0,null,0,null,0,null,0,null,0,null,0,null,0,null,0,null,0,null,0,null,0,null,0,null,0,null,0,null,0,null,null,null,null,null,null,null,"No","No"]
[null,null,"Curve radius (R2), ft:",null,null,null,null,0,null,0,null,0,null,0,null,0,null,0,null,0,null,0,null,0,null,0,null,0,null,0,null,0,null,0,null,0,null,0,null,0,null,0,null,0,null,0,null,0,0,0,0,0,0,0,0]
[null,null,"Length of curve (Lc2), mi:",null,null,null,null,{"$f":"G19","v":0},null,0,null,0,null,0,null,0,null,0,null,0,null,0,null,0,null,0,null,0,null,0,null,0,null,0,null,0,null,0,null,0,null,0,null,0,null,0,null,0,0,0,0,0,0,0,0]
[null,null,"Length of curve in segment (Lc2,seg), mi:",null,null,null,null,0,null,0,null,0,null,0,null,0,null,0,null,0,null,0,null,0,null,0,null,0,null,0,null,0,null,0,null,0,null,0,null,0,null,0,null,0,null,0,null,0,0,0,0,0,0,0,0]
[null,3,"Horizontal curve in segment?:",null,null,null,"No",{"$f":"G21","v":"No"},"No","No","No","No","No","No",null,0,null,0,null,0,null,0,null,0,null,0,null,0,null,0,null,0,null,0,null,0,null,0,null,0,null,0,null,0,null,0]
[null,null,"Curve radius (R3), ft:",null,null,null,null,{"$f":"G22","v":0},null,0,null,0,null,0,null,0,null,0,null,0,null,0,null,0,null,0,null,0,null,0,null,0,null,0,null,0,null,0,null,0,null,0,null,0,null,0,null,0,0,0,0,0,0,0,0]
[null,null,"Length of curve (Lc3), mi:",null,null,null,null,0,null,0,null,0,null,0,null,0,null,0,null,0,null,0,null,0,null,0,null,0,null,0,null,0,null,0,null,0,null,0,null,0,null,0,null,0,null,0,null,0,0,0,0,0,0,0,0]
[null,null,"Length of curve in segment (Lc3,seg), mi:",null,null,null,null,0,null,0,null,0,null,0,null,0,null,0,null,0,null,0,null,0,null,0,null,0,null,0,null,0,null,0,null,0,null,0,null,0,null,0,null,0,null,0,null,0,0,0,0,0,0,0,0]
[null,"Cross Section Data"]
[null,"Lane width (Wl), ft:",null,null,null,null,10.8,12,10.8,{"$f":"I26","v":10.8},12,{"$f":"K26","v":12},12,{"$f":"M26","v":12},null,{"$f":"O26","v":0},null,{"$f":"Q26","v":0},null,{"$f":"S26","v":0},null,{"$f":"U26","v":0},null,{"$f":"W26","v":0},null,{"$f":"Y26","v":0},null,{"$f":"AA26","v":0},null,{"$f":"AC26","v":0},null,{"$f":"AE26","v":0},null,{"$f":"AG26","v":0},null,{"$f":"AI26","v":0},null,{"$f":"AK26","v":0},null,{"$f":"AM26","v":0},null,{"$f":"AO26","v":0},null,{"$f":"AQ26","v":0},null,{"$f":"AS26","v":0},null,10.800000190734863,12,10.800000190734863,10.800000190734863,12,12,12,12]
[null,"Outside shoulder width (Ws), ft:",null,null,null,null,4,{"$f":"G27","v":4},5,5,9,9,10,10,null,0,null,0,null,0,null,0,null,0,null,0,null,0,null,0,null,0,null,0,null,0,null,0,null,0,null,0,null,0,null,0,null,4,4,5,5,9,9,10,10]
[null,"Inside shoulder width (Wis), ft:",null,null,null,null,2.5,2.5,2.5,2.5,9,9,9,9,null,0,null,0,null,0,null,0,null,0,null,0,null,0,null,0,null,0,null,0,null,0,null,0,null,0,null,0,null,0,null,0,null,2.5,2.5,2.5,2.5,9,9,9,9]
[null,"Median width (Wm), ft:",null,null,null,null,7,7,7,7,21,21,22,22,null,0,null,0,null,0,null,0,null,0,null,0,null,0,null,0,null,0,null,0,null,0,null,0,null,0,null,0,null,0,null,0,null,7,7,7,7,21,21,22,22]
[null,"Rumble strips on outside shoulders?:",null,null,null,null,"No","No","No","No","Yes","Yes","Yes","Yes",null,0,null,0,null,0,null,0,null,0,null,0,null,0,null,0,null,0,null,0,null,0,null,0,null,0,null,0,null,0,null,0,null,"No","No","No","No","Yes","Yes","Yes","Yes"]
[null,null,"Length of rumble strips for travel in increasing milepost direction, mi:",null,null,null,null,0,null,0,0.08,0.08,0.25,0.25,null,0,null,0,null,0,null,0,null,0,null,0,null,0,null,0,null,0,null,0,null,0,null,0,null,0,null,0,null,0,null,0,null,null,null,null,null,"Sum=0.16","Sum=0.16","Sum=0.50","Sum=0.50"]
[null,null,"Length of rumble strips for travel in decreasing milepost direction, mi:",null,null,null,null,0,null,0,0.08,0.08,0.25,0.25,null,0,null,0,null,0,null,0,null,0,null,0,null,0,null,0,null,0,null,0,null,0,null,0,null,0,null,0,null,0,null,0]
[null,"Rumble strips on inside shoulders?:",null,null,null,null,"No","No","No","No","Yes","Yes","Yes","Yes",null,0,null,0,null,0,null,0,null,0,null,0,null,0,null,0,null,0,null,0,null,0,null,0,null,0,null,0,null,0,null,0,null,"No","No","No","No","Yes","Yes","Yes","Yes"]
[null,null,"Length of rumble strips for travel in increasing milepost direction, mi:",null,null,null,null,0,null,0,0.08,0.08,0.17499999999999999,0.17499999999999999,null,0,null,0,null,0,null,0,null,0,null,0,null,0,null,0,null,0,null,0,null,0,null,0,null,0,null,0,null,0,null,0,null,null,null,null,null,"Sum=0.16","Sum=0.16","Sum=0.35","Sum=0.35"]
[null,null,"Length of rumble strips for travel in decreasing milepost direction, mi:",null,null,null,null,0,null,0,0.08,0.08,0.17499999999999999,0.17499999999999999,null,0,null,0,null,0,null,0,null,0,null,0,null,0,null,0,null,0,null,0,null,0,null,0,null,0,null,0,null,0,null,0]
[null,"Presence of barrier in median:",null,null,null,null,"Center","Center","Center","Center","Center","Center","Center","Center",null,0,null,0,null,0,null,0,null,0,null,0,null,0,null,0,null,0,null,0,null,0,null,0,null,0,null,0,null,0,null,0,null,"Center","Center","Center","Center","Center","Center","Center","Center"]
[null,1,"Length of barrier (Lib,1), mi:",null,null,null,null,0,null,0,null,0,null,0,null,0,null,0,null,0,null,0,null,0,null,0,null,0,null,0,null,0,null,0,null,0,null,0,null,0,null,0,null,0,null,0,null,0,0,0,0,0,0,0,0]
[null,null,"Distance from edge of traveled way to barrier face (Woff,in,1), ft:",null,null,null,null,0,null,0,null,0,null,0,null,0,null,0,null,0,null,0,null,0,null,0,null,0,null,0,null,0,null,0,null,0,null,0,null,0,null,0,null,0,null,0,null,0,0,0,0,0,0,0,0]
[null,2,"Length of barrier (Lib,2), mi:",null,null,null,null,0,null,0,null,0,null,0,null,0,null,0,null,0,null,0,null,0,null,0,null,0,null,0,null,0,null,0,null,0,null,0,null,0,null,0,null,0,null,0,null,0,0,0,0,0,0,0,0]
[null,null,"Distance from edge of traveled way to barrier face (Woff,in,2), ft:",null,null,null,null,0,null,0,null,0,null,0,null,0,null,0,null,0,null,0,null,0,null,0,null,0,null,0,null,0,null,0,null,0,null,0,null,0,null,0,null,0,null,0,null,0,0,0,0,0,0,0,0]
[null,3,"Length of barrier (Lib,3), mi:",null,null,null,null,0,null,0,null,0,null,0,null,0,null,0,null,0,null,0,null,0,null,0,null,0,null,0,null,0,null,0,null,0,null,0,null,0,null,0,null,0,null,0,null,0,0,0,0,0,0,0,0]
[null,null,"Distance from edge of traveled way to barrier face (Woff,in,3), ft:",null,null,null,null,0,null,0,null,0,null,0,null,0,null,0,null,0,null,0,null,0,null,0,null,0,null,0,null,0,null,0,null,0,null,0,null,0,null,0,null,0,null,0,null,0,0,0,0,0,0,0,0]
[null,4,"Length of barrier (Lib,4), mi:",null,null,null,null,0,null,0,null,0,null,0,null,0,null,0,null,0,null,0,null,0,null,0,null,0,null,0,null,0,null,0,null,0,null,0,null,0,null,0,null,0,null,0,null,0,0,0,0,0,0,0,0]
[null,null,"Distance from edge of traveled way to barrier face (Woff,in,4), ft:",null,null,null,null,0,null,0,null,0,null,0,null,0,null,0,null,0,null,0,null,0,null,0,null,0,null,0,null,0,null,0,null,0,null,0,null,0,null,0,null,0,null,0,null,0,0,0,0,0,0,0,0]
[null,5,"Length of barrier (Lib,5), mi:",null,null,null,null,0,null,0,null,0,null,0,null,0,null,0,null,0,null,0,null,0,null,0,null,0,null,0,null,0,null,0,null,0,null,0,null,0,null,0,null,0,null,0,null,0,0,0,0,0,0,0,0]
[null,null,"Distance from edge of traveled way to barrier face (Woff,in,5), ft:",null,null,null,null,0,null,0,null,0,null,0,null,0,null,0,null,0,null,0,null,0,null,0,null,0,null,0,null,0,null,0,null,0,null,0,null,0,null,0,null,0,null,0,null,0,0,0,0,0,0,0,0]
[null,"Median barrier width (Wib), ft:",null,null,null,null,1.5,1.5,1.5,1.5,2.5,2.5,3.5,3.5,null,0,null,0,null,0,null,0,null,0,null,0,null,0,null,0,null,0,null,0,null,0,null,0,null,0,null,0,null,0,null,0,null,1.5,1.5,1.5,1.5,2.5,2.5,3.5,3.5]
[null,"Nearest distance from edge of traveled way to barrier face (Wnear), ft:",null,null,null,null,null,0,null,0,null,0,null,0,null,0,null,0,null,0,null,0,null,0,null,0,null,0,null,0,null,0,null,0,null,0,null,0,null,0,null,0,null,0,null,0,null,0,0,0,0,0,0,0,0]
[null,"Roadside Data"]
[null,"Clear zone width (Whc), ft:",null,null,null,null,20,{"$f":"G50","v":20},30,{"$f":"I50","v":30},9,{"$f":"K50","v":9},30,{"$f":"M50","v":30},null,{"$f":"O50","v":0},null,{"$f":"Q50","v":0},null,{"$f":"S50","v":0},null,{"$f":"U50","v":0},null,{"$f":"W50","v":0},null,{"$f":"Y50","v":0},null,{"$f":"AA50","v":0},null,{"$f":"AC50","v":0},null,{"$f":"AE50","v":0},null,{"$f":"AG50","v":0},null,{"$f":"AI50","v":0},null,{"$f":"AK50","v":0},null,{"$f":"AM50","v":0},null,{"$f":"AO50","v":0},null,{"$f":"AQ50","v":0},null,{"$f":"AS50","v":0},null,20,20,30,30,9,9,30,30]
[null,"Presence of barrier on roadside:",null,null,null,null,"Some","Some","Some","Some","None","None","None","None",null,0,null,0,null,0,null,0,null,0,null,0,null,0,null,0,null,0,null,0,null,0,null,0,null,0,null,0,null,0,null,0,null,"Some","Some","Some","Some","None","None","None","None"]
[null,1,"Length of barrier (Lob,1), mi:",null,null,null,3.5999999999999997E-2,3.5999999999999997E-2,0.01,0.01,null,0,null,0,null,0,null,0,null,0,null,0,null,0,null,0,null,0,null,0,null,0,null,0,null,0,null,0,null,0,null,0,null,0,null,0,null,3.5999998450279236E-2,3.5999998450279236E-2,9.9999997764825821E-3,9.9999997764825821E-3,0,0,0,0]
[null,null,"Distance from edge of traveled way to barrier face (Woff,o,1), ft:",null,null,null,6.5,6.5,7.5,7.5,null,0,null,0,null,0,null,0,null,0,null,0,null,0,null,0,null,0,null,0,null,0,null,0,null,0,null,0,null,0,null,0,null,0,null,0,null,6.5,6.5,7.5,7.5,0,0,0,0]
[null,2,"Length of barrier (Lob,2), mi:",null,null,null,null,0,null,0,null,0,null,0,null,0,null,0,null,0,null,0,null,0,null,0,null,0,null,0,null,0,null,0,null,0,null,0,null,0,null,0,null,0,null,0,null,0,0,0,0,0,0,0,0]
[null,null,"Distance from edge of traveled way to barrier face (Woff,o,2), ft:",null,null,null,null,0,null,0,null,0,null,0,null,0,null,0,null,0,null,0,null,0,null,0,null,0,null,0,null,0,null,0,null,0,null,0,null,0,null,0,null,0,null,0,null,0,0,0,0,0,0,0,0]
[null,3,"Length of barrier (Lob,3), mi:",null,null,null,null,0,null,0,null,0,null,0,null,0,null,0,null,0,null,0,null,0,null,0,null,0,null,0,null,0,null,0,null,0,null,0,null,0,null,0,null,0,null,0,null,0,0,0,0,0,0,0,0]
[null,null,"Distance from edge of traveled way to barrier face (Woff,o,3), ft:",null,null,null,null,0,null,0,null,0,null,0,null,0,null,0,null,0,null,0,null,0,null,0,null,0,null,0,null,0,null,0,null,0,null,0,null,0,null,0,null,0,null,0,null,0,0,0,0,0,0,0,0]
[null,4,"Length of barrier (Lob,4), mi:",null,null,null,null,0,null,0,null,0,null,0,null,0,null,0,null,0,null,0,null,0,null,0,null,0,null,0,null,0,null,0,null,0,null,0,null,0,null,0,null,0,null,0,null,0,0,0,0,0,0,0,0]
[null,null,"Distance from edge of traveled way to barrier face (Woff,o,4), ft:",null,null,null,null,0,null,0,null,0,null,0,null,0,null,0,null,0,null,0,null,0,null,0,null,0,null,0,null,0,null,0,null,0,null,0,null,0,null,0,null,0,null,0,null,0,0,0,0,0,0,0,0]
[null,5,"Length of barrier (Lob,5), mi:",null,null,null,null,0,null,0,null,0,null,0,null,0,null,0,null,0,null,0,null,0,null,0,null,0,null,0,null,0,null,0,null,0,null,0,null,0,null,0,null,0,null,0,null,0,0,0,0,0,0,0,0]
[null,null,"Distance from edge of traveled way to barrier face (Woff,o,5), ft:",null,null,null,null,0,null,0,null,0,null,0,null,0,null,0,null,0,null,0,null,0,null,0,null,0,null,0,null,0,null,0,null,0,null,0,null,0,null,0,null,0,null,0,null,0,0,0,0,0,0,0,0]
[null,"Distance from edge of traveled way to barrier face, increasing milepost (Woff,inc), ft:",null,null,null,null,null,0,null,0,null,0,null,0,null,0,null,0,null,0,null,0,null,0,null,0,null,0,null,0,null,0,null,0,null,0,null,0,null,0,null,0,null,0,null,0,null,0,0,0,0,0,0,0,0]
[null,"Distance from edge of traveled way to barrier face, decreasing milepost (Woff,dec), ft:",null,null,null,null,null,0,null,0,null,0,null,0,null,0,null,0,null,0,null,0,null,0,null,0,null,0,null,0,null,0,null,0,null,0,null,0,null,0,null,0,null,0,null,0,null,0,0,0,0,0,0,0,0]
[null,"Ramp Access Data"]
[null,"Travel in Increasing Milepost Direction"]
[null,"Entrance","Ramp entrance in segment? (If yes, indicate type.):",null,null,null,"No",{"$f":"G66","v":"No"},"S-C Lane",{"$f":"I66","v":"S-C Lane"},"No",{"$f":"K66","v":"No"},"No",{"$f":"M66","v":"No"},null,{"$f":"O66","v":0},null,{"$f":"Q66","v":0},null,{"$f":"S66","v":0},null,{"$f":"U66","v":0},null,{"$f":"W66","v":0},null,{"$f":"Y66","v":0},null,{"$f":"AA66","v":0},null,{"$f":"AC66","v":0},null,{"$f":"AE66","v":0},null,{"$f":"AG66","v":0},null,{"$f":"AI66","v":0},null,{"$f":"AK66","v":0},null,{"$f":"AM66","v":0},null,{"$f":"AO66","v":0},null,{"$f":"AQ66","v":0},null,{"$f":"AS66","v":0},null,"No","No","S-C Lane","S-C Lane","No","No","No","No"]
[null,"Ramp","Distance from begin milepost to upstream entrance ramp gore (Xb,ent), mi:",null,null,null,999,999,null,{"$f":"I67","v":0},0.1084,0.1084,0.36840000000000001,0.36840000000000001,null,0,null,0,null,0,null,0,null,0,null,0,null,0,null,0,null,0,null,0,null,0,null,0,null,0,null,0,null,0,null,0,null,999,999,0,0,0.10840000212192535,0.10840000212192535,0.36840000748634338,0.36840000748634338]
[null,null,"Length of ramp entrance (Len,inc), mi:",null,null,null,null,0,7.0000000000000007E-2,{"$f":"I68","v":7.0000000000000007E-2},null,0,null,0,null,0,null,0,null,0,null,0,null,0,null,0,null,0,null,0,null,0,null,0,null,0,null,0,null,0,null,0,null,0,null,0,null,0,0,7.0000000298023224E-2,7.0000000298023224E-2,0,0,0,0]
[null,null,"Length of ramp entrance in segment (Len,seg,inc), mi:",null,null,null,null,0,3.4000000000000002E-2,3.4000000000000002E-2,null,0,null,0,null,0,null,0,null,0,null,0,null,0,null,0,null,0,null,0,null,0,null,0,null,0,null,0,null,0,null,0,null,0,null,0,null,0,0,3.4000001847743988E-2,3.4000001847743988E-2,0,0,0,0]
[null,null,"Entrance side?:",null,null,null,null,0,"Right","Right",null,0,null,0,null,0,null,0,null,0,null,0,null,0,null,0,null,0,null,0,null,0,null,0,null,0,null,0,null,0,null,0,null,0,null,0,null,null,null,"Right","Right"]
[null,"Exit","Ramp exit in segment? (If yes, indicate type.):",null,null,null,"No","No","No","No","No","No","No","No",null,0,null,0,null,0,null,0,null,0,null,0,null,0,null,0,null,0,null,0,null,0,null,0,null,0,null,0,null,0,null,0,null,"No","No","No","No","No","No","No","No"]
[null,"Ramp","Distance from end milepost to downstream exit ramp gore (Xe,ext), mi:",null,null,null,1.7607999999999999,1.7607999999999999,1.7108000000000001,1.7108000000000001,0.26240000000000002,0.26240000000000002,0.83199999999999996,0.83199999999999996,null,0,null,0,null,0,null,0,null,0,null,0,null,0,null,0,null,0,null,0,null,0,null,0,null,0,null,0,null,0,null,0,null,1.7608000040054321,1.7608000040054321,1.7108000516891479,1.7108000516891479,0.26240000128746033,0.26240000128746033,0.8320000171661377,0.8320000171661377]
[null,null,"Length of ramp exit (Lex,inc), mi:",null,null,null,null,0,null,0,null,0,null,0,null,0,null,0,null,0,null,0,null,0,null,0,null,0,null,0,null,0,null,0,null,0,null,0,null,0,null,0,null,0,null,0,null,0,0,0,0,0,0,0,0]
[null,null,"Length of ramp exit in segment (Lex,seg,inc), mi:",null,null,null,null,0,null,0,null,0,null,0,null,0,null,0,null,0,null,0,null,0,null,0,null,0,null,0,null,0,null,0,null,0,null,0,null,0,null,0,null,0,null,0,null,0,0,0,0,0,0,0,0]
[null,null,"Exit side?:",null,null,null,null,0,null,0,null,0,null,0,null,0,null,0,null,0,null,0,null,0,null,0,null,0,null,0,null,0,null,0,null,0,null,0,null,0,null,0,null,0,null,0]
[null,"Weave","Type B weave in segment?:",null,null,null,"No","No","No","No","Yes","Yes","Yes","Yes",null,0,null,0,null,0,null,0,null,0,null,0,null,0,null,0,null,0,null,0,null,0,null,0,null,0,null,0,null,0,null,0,null,"No","No","No","No","Yes","Yes","Yes","Yes"]
[null,null,"Length of weaving section (Lwev,inc), mi:",null,null,null,null,0,null,0,0.35,0.35,0.35,0.35,null,0,null,0,null,0,null,0,null,0,null,0,null,0,null,0,null,0,null,0,null,0,null,0,null,0,null,0,null,0,null,0,null,0,0,0,0,0.34999999403953552,0.34999999403953552,0.34999999403953552,0.34999999403953552]
[null,null,"Length of weaving section in segment (Lwev,seg,inc), mi:",null,null,null,null,0,null,0,0.08,0.08,0.01,0.01,null,0,null,0,null,0,null,0,null,0,null,0,null,0,null,0,null,0,null,0,null,0,null,0,null,0,null,0,null,0,null,0,null,0,0,0,0,7.9999998211860657E-2,7.9999998211860657E-2,9.9999997764825821E-3,9.9999997764825821E-3]
[null,"Travel in Decreasing Milepost Direction"]
[null,"Entrance","Ramp entrance in segment? (If yes, indicate type.):",null,null,null,"No",{"$f":"G80","v":"No"},"No",{"$f":"I80","v":"No"},"No",{"$f":"K80","v":"No"},"No",{"$f":"M80","v":"No"},null,{"$f":"O80","v":0},null,{"$f":"Q80","v":0},null,{"$f":"S80","v":0},null,{"$f":"U80","v":0},null,{"$f":"W80","v":0},null,{"$f":"Y80","v":0},null,{"$f":"AA80","v":0},null,{"$f":"AC80","v":0},null,{"$f":"AE80","v":0},null,{"$f":"AG80","v":0},null,{"$f":"AI80","v":0},null,{"$f":"AK80","v":0},null,{"$f":"AM80","v":0},null,{"$f":"AO80","v":0},null,{"$f":"AQ80","v":0},null,{"$f":"AS80","v":0},null,"No","No","No","No","No","No","No","No"]
[null,"Ramp","Distance from end milepost to upstream entrance ramp gore (Xe,ent), mi:",null,null,null,1.6596,1.6596,1.6095999999999999,1.6095999999999999,0.2576,0.2576,0.70720000000000005,0.70720000000000005,null,0,null,0,null,0,null,0,null,0,null,0,null,0,null,0,null,0,null,0,null,0,null,0,null,0,null,0,null,0,null,0,null,1.6596000194549561,1.6596000194549561,1.6095999479293823,1.6095999479293823,0.25760000944137573,0.25760000944137573,0.70719999074935913,0.70719999074935913]
[null,null,"Length of ramp entrance (Len,dec), mi:",null,null,null,null,0,null,0,null,0,null,0,null,0,null,0,null,0,null,0,null,0,null,0,null,0,null,0,null,0,null,0,null,0,null,0,null,0,null,0,null,0,null,0,null,0,0,0,0,0,0,0,0]
[null,null,"Length of ramp entrance in segment (Len,seg,dec), mi:",null,null,null,null,0,null,0,null,0,null,0,null,0,null,0,null,0,null,0,null,0,null,0,null,0,null,0,null,0,null,0,null,0,null,0,null,0,null,0,null,0,null,0,null,0,0,0,0,0,0,0,0]
[null,null,"Entrance side?:",null,null,null,null,0,null,0,null,0,null,0,null,0,null,0,null,0,null,0,null,0,null,0,null,0,null,0,null,0,null,0,null,0,null,0,null,0,null,0,null,0,null,0]
[null,"Exit","Ramp exit in segment? (If yes, indicate type.):",null,null,null,"No","No","S-C Lane",{"$f":"I85","v":"S-C Lane"},"No","No","No","No",null,0,null,0,null,0,null,0,null,0,null,0,null,0,null,0,null,0,null,0,null,0,null,0,null,0,null,0,null,0,null,0,null,"No","No","S-C Lane","S-C Lane","No","No","No","No"]
[null,"Ramp","Distance from begin milepost to downstream exit ramp gore (Xb,ext), mi:",null,null,null,999,{"$f":"G86","v":999},null,0,999,999,999,{"$f":"M86","v":999},null,0,null,0,null,0,null,0,null,0,null,0,null,0,null,0,null,0,null,0,null,0,null,0,null,0,null,0,null,0,null,0,null,999,999,0,0,999,999,999,999]
[null,null,"Length of ramp exit (Lex,dec), mi:",null,null,null,null,0,7.0000000000000007E-2,7.0000000000000007E-2,null,0,null,0,null,0,null,0,null,0,null,0,null,0,null,0,null,0,null,0,null,0,null,0,null,0,null,0,null,0,null,0,null,0,null,0,null,0,0,7.0000000298023224E-2,7.0000000298023224E-2,0,0,0,0]
[null,null,"Length of ramp exit in segment (Lex,seg,dec), mi:",null,null,null,null,0,0.03,0.03,null,0,null,0,null,0,null,0,null,0,null,0,null,0,null,0,null,0,null,0,null,0,null,0,null,0,null,0,null,0,null,0,null,0,null,0,null,0,0,2.9999999329447746E-2,2.9999999329447746E-2,0,0,0,0]
[null,null,"Exit side?:",null,null,null,null,0,"Right","Right",null,0,null,0,null,0,null,0,null,0,null,0,null,0,null,0,null,0,null,0,null,0,null,0,null,0,null,0,null,0,null,0,null,0,null,0,null,null,null,"Right","Right"]
[null,"Weave","Type B weave in segment?:",null,null,null,"No","No","No","No","No","No","No","No",null,0,null,0,null,0,null,0,null,0,null,0,null,0,null,0,null,0,null,0,null,0,null,0,null,0,null,0,null,0,null,0,null,"No","No","No","No","No","No","No","No"]
[null,null,"Length of weaving section (Lwev,dec), mi:",null,null,null,null,0,null,0,null,0,null,0,null,0,null,0,null,0,null,0,null,0,null,0,null,0,null,0,null,0,null,0,null,0,null,0,null,0,null,0,null,0,null,0,null,0,0,0,0,0,0,0,0]
[null,null,"Length of weaving section in segment (Lwev,seg,dec), mi:",null,null,null,null,0,null,0,null,0,null,0,null,0,null,0,null,0,null,0,null,0,null,0,null,0,null,0,null,0,null,0,null,0,null,0,null,0,null,0,null,0,null,0,null,0,0,0,0,0,0,0,0]
[null,"Traffic Data",null,null,null,"Year"]
[null,"Proportion of AADT during high-volume hours (Phv):",null,null,null,null,0.28999999999999998,null,0.17,null,0,null,0,null,null,null,null,null,null,null,null,null,null,null,null,null,null,null,null,null,null,null,null,null,null,null,null,null,null,null,null,null,null,null,null,null,null,0.28999999165534973,null,0.17000000178813934,null,0,null,0]
[null,"Freeway Segment Data ",null,null,null,{"$f":"Main!AC5","v":2005},85912,null,72140,null,47284,null,36968,null,null,null,null,null,null,null,null,null,null,null,null,null,null,null,null,null,null,null,null,null,null,null,null,null,null,null,null,null,null,null,null,null,null,85912,null,72140,null,47284,null,36968]
[null,"Average daily traffic (AADTfs) by year, veh/d:",null,null,null,{"$f":"F95+1","v":2006},null,null,null,null,null,null,null,null,null,null,null,null,null,null,null,null,null,null,null,null,null,null,null,null,null,null,null,null,null,null,null,null,null,null,null,null,null,null,null,null,null,0,null,0,null,0,null,0]
[null," (enter data only for those years for which",null,null,null,{"$f":"F96+1","v":2007},null,null,null,null,50000,null,null,null,null,null,null,null,null,null,null,null,null,null,null,null,null,null,null,null,null,null,null,null,null,null,null,null,null,null,null,null,null,null,null,null,null,0,null,0,null,50000,null,0]
[null,"  it is available, leave other years blank)",null,null,null,2008,null,null,null,null,null,null,null,null,null,null,null,null,null,null,null,null,null,null,null,null,null,null,null,null,null,null,null,null,null,null,null,null,null,null,null,null,null,null,null,null,null,0,null,0,null,0,null,0]
[null,null,null,null,null,2009,null,null,null,null,null,null,null,null,null,null,null,null,null,null,null,null,null,null,null,null,null,null,null,null,null,null,null,null,null,null,null,null,null,null,null,null,null,null,null,null,null,0,null,0,null,0,null,0]
[null,null,null,null,null,2010,null,null,null,null,null,null,null,null,null,null,null,null,null,null,null,null,null,null,null,null,null,null,null,null,null,null,null,null,null,null,null,null,null,null,null,null,null,null,null,null,null,0,null,0,null,0,null,0]
[null,null,null,null,null,2011,null,null,null,null,null,null,null,null,null,null,null,null,null,null,null,null,null,null,null,null,null,null,null,null,null,null,null,null,null,null,null,null,null,null,null,null,null,null,null,null,null,0,null,0,null,0,null,0]
[null,null,null,null,null,2012,null,null,null,null,null,null,null,null,null,null,null,null,null,null,null,null,null,null,null,null,null,null,null,null,null,null,null,null,null,null,null,null,null,null,null,null,null,null,null,null,null,0,null,0,null,0,null,0]
[null,null,null,null,null,2013,null,null,null,null,null,null,null,null,null,null,null,null,null,null,null,null,null,null,null,null,null,null,null,null,null,null,null,null,null,null,null,null,null,null,null,null,null,null,null,null,null,0,null,0,null,0,null,0]
[null,null,null,null,null,2014,null,null,null,null,null,null,null,null,null,null,null,null,null,null,null,null,null,null,null,null,null,null,null,null,null,null,null,null,null,null,null,null,null,null,null,null,null,null,null,null,null,0,null,0,null,0,null,0]
[null,null,null,null,null,2015,null,null,null,null,null,null,null,null,null,null,null,null,null,null,null,null,null,null,null,null,null,null,null,null,null,null,null,null,null,null,null,null,null,null,null,null,null,null,null,null,null,0,null,0,null,0,null,0]
[null,null,null,null,null,2016,null,null,null,null,null,null,null,null,null,null,null,null,null,null,null,null,null,null,null,null,null,null,null,null,null,null,null,null,null,null,null,null,null,null,null,null,null,null,null,null,null,0,null,0,null,0,null,0]
[null,null,null,null,null,2017,null,null,null,null,null,null,null,null,null,null,null,null,null,null,null,null,null,null,null,null,null,null,null,null,null,null,null,null,null,null,null,null,null,null,null,null,null,null,null,null,null,0,null,0,null,0,null,0]
[null,null,null,null,null,2018,null,null,null,null,null,null,null,null,null,null,null,null,null,null,null,null,null,null,null,null,null,null,null,null,null,null,null,null,null,null,null,null,null,null,null,null,null,null,null,null,null,0,null,0,null,0,null,0]
[null,null,null,null,null,2019,null,null,null,null,null,null,null,null,null,null,null,null,null,null,null,null,null,null,null,null,null,null,null,null,null,null,null,null,null,null,null,null,null,null,null,null,null,null,null,null,null,0,null,0,null,0,null,0]
[null,null,null,null,null,2020,null,null,null,null,null,null,null,null,null,null,null,null,null,null,null,null,null,null,null,null,null,null,null,null,null,null,null,null,null,null,null,null,null,null,null,null,null,null,null,null,null,0,null,0,null,0,null,0]
[null,null,null,null,null,2021,null,null,null,null,null,null,null,null,null,null,null,null,null,null,null,null,null,null,null,null,null,null,null,null,null,null,null,null,null,null,null,null,null,null,null,null,null,null,null,null,null,0,null,0,null,0,null,0]
[null,null,null,null,null,2022,null,null,null,null,null,null,null,null,null,null,null,null,null,null,null,null,null,null,null,null,null,null,null,null,null,null,null,null,null,null,null,null,null,null,null,null,null,null,null,null,null,0,null,0,null,0,null,0]
[null,null,null,null,null,2023,null,null,null,null,null,null,null,null,null,null,null,null,null,null,null,null,null,null,null,null,null,null,null,null,null,null,null,null,null,null,null,null,null,null,null,null,null,null,null,null,null,0,null,0,null,0,null,0]
[null,null,null,null,null,2024,null,null,null,null,null,null,null,null,null,null,null,null,null,null,null,null,null,null,null,null,null,null,null,null,null,null,null,null,null,null,null,null,null,null,null,null,null,null,null,null,null,0,null,0,null,0,null,0]
[null,null,null,null,null,2025,null,null,null,null,null,null,null,null,null,null,null,null,null,null,null,null,null,null,null,null,null,null,null,null,null,null,null,null,null,null,null,null,null,null,null,null,null,null,null,null,null,0,null,0,null,0,null,0]
[null,null,null,null,null,2026,null,null,null,null,null,null,null,null,null,null,null,null,null,null,null,null,null,null,null,null,null,null,null,null,null,null,null,null,null,null,null,null,null,null,null,null,null,null,null,null,null,0,null,0,null,0,null,0]
[null,null,null,null,null,2027,null,null,null,null,null,null,null,null,null,null,null,null,null,null,null,null,null,null,null,null,null,null,null,null,null,null,null,null,null,null,null,null,null,null,null,null,null,null,null,null,null,0,null,0,null,0,null,0]
[null,null,null,null,null,2028,null,null,null,null,null,null,null,null,null,null,null,null,null,null,null,null,null,null,null,null,null,null,null,null,null,null,null,null,null,null,null,null,null,null,null,null,null,null,null,null,null,0,null,0,null,0,null,0]
[null,"Entrance Ramp Data for Travel in Increasing Milepost Dir.",null,null,null,"Year"]
[null,"Average daily traffic (AADTb,ent) by year, veh/d:",null,null,null,{"$f":"F95","v":2005},null,null,10145,null,1358,null,1358,null,null,null,null,null,null,null,null,null,null,null,null,null,null,null,null,null,null,null,null,null,null,null,null,null,null,null,null,null,null,null,null,null,null,0,null,10145,null,1358,null,1358]
[null," (enter data only for those years for which",null,null,null,2006,null,null,null,null,null,null,null,null,null,null,null,null,null,null,null,null,null,null,null,null,null,null,null,null,null,null,null,null,null,null,null,null,null,null,null,null,null,null,null,null,null,0,null,0,null,0,null,0]
[null,"  it is available, leave other years blank)",null,null,null,2007,null,null,null,null,null,null,null,null,null,null,null,null,null,null,null,null,null,null,null,null,null,null,null,null,null,null,null,null,null,null,null,null,null,null,null,null,null,null,null,null,null,0,null,0,null,0,null,0]
[null,null,null,null,null,2008,null,null,null,null,null,null,null,null,null,null,null,null,null,null,null,null,null,null,null,null,null,null,null,null,null,null,null,null,null,null,null,null,null,null,null,null,null,null,null,null,null,0,null,0,null,0,null,0]
[null,null,null,null,null,2009,null,null,null,null,null,null,null,null,null,null,null,null,null,null,null,null,null,null,null,null,null,null,null,null,null,null,null,null,null,null,null,null,null,null,null,null,null,null,null,null,null,0,null,0,null,0,null,0]
[null,null,null,null,null,2010,null,null,null,null,null,null,null,null,null,null,null,null,null,null,null,null,null,null,null,null,null,null,null,null,null,null,null,null,null,null,null,null,null,null,null,null,null,null,null,null,null,0,null,0,null,0,null,0]
[null,null,null,null,null,2011,null,null,null,null,null,null,null,null,null,null,null,null,null,null,null,null,null,null,null,null,null,null,null,null,null,null,null,null,null,null,null,null,null,null,null,null,null,null,null,null,null,0,null,0,null,0,null,0]
[null,null,null,null,null,2012,null,null,null,null,null,null,null,null,null,null,null,null,null,null,null,null,null,null,null,null,null,null,null,null,null,null,null,null,null,null,null,null,null,null,null,null,null,null,null,null,null,0,null,0,null,0,null,0]
[null,null,null,null,null,2013,null,null,null,null,null,null,null,null,null,null,null,null,null,null,null,null,null,null,null,null,null,null,null,null,null,null,null,null,null,null,null,null,null,null,null,null,null,null,null,null,null,0,null,0,null,0,null,0]
[null,null,null,null,null,2014,null,null,null,null,null,null,null,null,null,null,null,null,null,null,null,null,null,null,null,null,null,null,null,null,null,null,null,null,null,null,null,null,null,null,null,null,null,null,null,null,null,0,null,0,null,0,null,0]
[null,null,null,null,null,2015,null,null,null,null,null,null,null,null,null,null,null,null,null,null,null,null,null,null,null,null,null,null,null,null,null,null,null,null,null,null,null,null,null,null,null,null,null,null,null,null,null,0,null,0,null,0,null,0]
[null,null,null,null,null,2016,null,null,null,null,null,null,null,null,null,null,null,null,null,null,null,null,null,null,null,null,null,null,null,null,null,null,null,null,null,null,null,null,null,null,null,null,null,null,null,null,null,0,null,0,null,0,null,0]
[null,null,null,null,null,2017,null,null,null,null,null,null,null,null,null,null,null,null,null,null,null,null,null,null,null,null,null,null,null,null,null,null,null,null,null,null,null,null,null,null,null,null,null,null,null,null,null,0,null,0,null,0,null,0]
[null,null,null,null,null,2018,null,null,null,null,null,null,null,null,null,null,null,null,null,null,null,null,null,null,null,null,null,null,null,null,null,null,null,null,null,null,null,null,null,null,null,null,null,null,null,null,null,0,null,0,null,0,null,0]
[null,null,null,null,null,2019,null,null,null,null,null,null,null,null,null,null,null,null,null,null,null,null,null,null,null,null,null,null,null,null,null,null,null,null,null,null,null,null,null,null,null,null,null,null,null,null,null,0,null,0,null,0,null,0]
[null,null,null,null,null,2020,null,null,null,null,null,null,null,null,null,null,null,null,null,null,null,null,null,null,null,null,null,null,null,null,null,null,null,null,null,null,null,null,null,null,null,null,null,null,null,null,null,0,null,0,null,0,null,0]
[null,null,null,null,null,2021,null,null,null,null,null,null,null,null,null,null,null,null,null,null,null,null,null,null,null,null,null,null,null,null,null,null,null,null,null,null,null,null,null,null,null,null,null,null,null,null,null,0,null,0,null,0,null,0]
[null,null,null,null,null,2022,null,null,null,null,null,null,null,null,null,null,null,null,null,null,null,null,null,null,null,null,null,null,null,null,null,null,null,null,null,null,null,null,null,null,null,null,null,null,null,null,null,0,null,0,null,0,null,0]
[null,null,null,null,null,2023,null,null,null,null,null,null,null,null,null,null,null,null,null,null,null,null,null,null,null,null,null,null,null,null,null,null,null,null,null,null,null,null,null,null,null,null,null,null,null,null,null,0,null,0,null,0,null,0]
[null,null,null,null,null,2024,null,null,null,null,null,null,null,null,null,null,null,null,null,null,null,null,null,null,null,null,null,null,null,null,null,null,null,null,null,null,null,null,null,null,null,null,null,null,null,null,null,0,null,0,null,0,null,0]
[null,null,null,null,null,2025,null,null,null,null,null,null,null,null,null,null,null,null,null,null,null,null,null,null,null,null,null,null,null,null,null,null,null,null,null,null,null,null,null,null,null,null,null,null,null,null,null,0,null,0,null,0,null,0]
[null,null,null,null,null,2026,null,null,null,null,null,null,null,null,null,null,null,null,null,null,null,null,null,null,null,null,null,null,null,null,null,null,null,null,null,null,null,null,null,null,null,null,null,null,null,null,null,0,null,0,null,0,null,0]
[null,null,null,null,null,2027,null,null,null,null,null,null,null,null,null,null,null,null,null,null,null,null,null,null,null,null,null,null,null,null,null,null,null,null,null,null,null,null,null,null,null,null,null,null,null,null,null,0,null,0,null,0,null,0]
[null,null,null,null,null,2028,null,null,null,null,null,null,null,null,null,null,null,null,null,null,null,null,null,null,null,null,null,null,null,null,null,null,null,null,null,null,null,null,null,null,null,null,null,null,null,null,null,0,null,0,null,0,null,0]
[null,"Exit Ramp Data for Travel in Increasing Milepost Direction",null,null,null,{"$f":"F119","v":"Year"}]
[null,"Average daily traffic (AADTe,ext) by year, veh/d:",null,null,null,2005,13295,null,13295,null,5765,null,5765,null,null,null,null,null,null,null,null,null,null,null,null,null,null,null,null,null,null,null,null,null,null,null,null,null,null,null,null,null,null,null,null,null,null,13295,null,13295,null,5765,null,5765]
[null," (enter data only for those years for which",null,null,null,2006,null,null,null,null,null,null,null,null,null,null,null,null,null,null,null,null,null,null,null,null,null,null,null,null,null,null,null,null,null,null,null,null,null,null,null,null,null,null,null,null,null,0,null,0,null,0,null,0]
[null,"  it is available, leave other years blank)",null,null,null,2007,null,null,null,null,null,null,null,null,null,null,null,null,null,null,null,null,null,null,null,null,null,null,null,null,null,null,null,null,null,null,null,null,null,null,null,null,null,null,null,null,null,0,null,0,null,0,null,0]
[null,null,null,null,null,2008,null,null,null,null,null,null,null,null,null,null,null,null,null,null,null,null,null,null,null,null,null,null,null,null,null,null,null,null,null,null,null,null,null,null,null,null,null,null,null,null,null,0,null,0,null,0,null,0]
[null,null,null,null,null,2009,null,null,null,null,null,null,null,null,null,null,null,null,null,null,null,null,null,null,null,null,null,null,null,null,null,null,null,null,null,null,null,null,null,null,null,null,null,null,null,null,null,0,null,0,null,0,null,0]
[null,null,null,null,null,2010,null,null,null,null,null,null,null,null,null,null,null,null,null,null,null,null,null,null,null,null,null,null,null,null,null,null,null,null,null,null,null,null,null,null,null,null,null,null,null,null,null,0,null,0,null,0,null,0]
[null,null,null,null,null,2011,null,null,null,null,null,null,null,null,null,null,null,null,null,null,null,null,null,null,null,null,null,null,null,null,null,null,null,null,null,null,null,null,null,null,null,null,null,null,null,null,null,0,null,0,null,0,null,0]
[null,null,null,null,null,2012,null,null,null,null,null,null,null,null,null,null,null,null,null,null,null,null,null,null,null,null,null,null,null,null,null,null,null,null,null,null,null,null,null,null,null,null,null,null,null,null,null,0,null,0,null,0,null,0]
[null,null,null,null,null,2013,null,null,null,null,null,null,null,null,null,null,null,null,null,null,null,null,null,null,null,null,null,null,null,null,null,null,null,null,null,null,null,null,null,null,null,null,null,null,null,null,null,0,null,0,null,0,null,0]
[null,null,null,null,null,2014,null,null,null,null,null,null,null,null,null,null,null,null,null,null,null,null,null,null,null,null,null,null,null,null,null,null,null,null,null,null,null,null,null,null,null,null,null,null,null,null,null,0,null,0,null,0,null,0]
[null,null,null,null,null,2015,null,null,null,null,null,null,null,null,null,null,null,null,null,null,null,null,null,null,null,null,null,null,null,null,null,null,null,null,null,null,null,null,null,null,null,null,null,null,null,null,null,0,null,0,null,0,null,0]
[null,null,null,null,null,2016,null,null,null,null,null,null,null,null,null,null,null,null,null,null,null,null,null,null,null,null,null,null,null,null,null,null,null,null,null,null,null,null,null,null,null,null,null,null,null,null,null,0,null,0,null,0,null,0]
[null,null,null,null,null,2017,null,null,null,null,null,null,null,null,null,null,null,null,null,null,null,null,null,null,null,null,null,null,null,null,null,null,null,null,null,null,null,null,null,null,null,null,null,null,null,null,null,0,null,0,null,0,null,0]
[null,null,null,null,null,2018,null,null,null,null,null,null,null,null,null,null,null,null,null,null,null,null,null,null,null,null,null,null,null,null,null,null,null,null,null,null,null,null,null,null,null,null,null,null,null,null,null,0,null,0,null,0,null,0]
[null,null,null,null,null,2019,null,null,null,null,null,null,null,null,null,null,null,null,null,null,null,null,null,null,null,null,null,null,null,null,null,null,null,null,null,null,null,null,null,null,null,null,null,null,null,null,null,0,null,0,null,0,null,0]
[null,null,null,null,null,2020,null,null,null,null,null,null,null,null,null,null,null,null,null,null,null,null,null,null,null,null,null,null,null,null,null,null,null,null,null,null,null,null,null,null,null,null,null,null,null,null,null,0,null,0,null,0,null,0]
[null,null,null,null,null,2021,null,null,null,null,null,null,null,null,null,null,null,null,null,null,null,null,null,null,null,null,null,null,null,null,null,null,null,null,null,null,null,null,null,null,null,null,null,null,null,null,null,0,null,0,null,0,null,0]
[null,null,null,null,null,2022,null,null,null,null,null,null,null,null,null,null,null,null,null,null,null,null,null,null,null,null,null,null,null,null,null,null,null,null,null,null,null,null,null,null,null,null,null,null,null,null,null,0,null,0,null,0,null,0]
[null,null,null,null,null,2023,null,null,null,null,null,null,null,null,null,null,null,null,null,null,null,null,null,null,null,null,null,null,null,null,null,null,null,null,null,null,null,null,null,null,null,null,null,null,null,null,null,0,null,0,null,0,null,0]
[null,null,null,null,null,2024,null,null,null,null,null,null,null,null,null,null,null,null,null,null,null,null,null,null,null,null,null,null,null,null,null,null,null,null,null,null,null,null,null,null,null,null,null,null,null,null,null,0,null,0,null,0,null,0]
[null,null,null,null,null,2025,null,null,null,null,null,null,null,null,null,null,null,null,null,null,null,null,null,null,null,null,null,null,null,null,null,null,null,null,null,null,null,null,null,null,null,null,null,null,null,null,null,0,null,0,null,0,null,0]
[null,null,null,null,null,2026,null,null,null,null,null,null,null,null,null,null,null,null,null,null,null,null,null,null,null,null,null,null,null,null,null,null,null,null,null,null,null,null,null,null,null,null,null,null,null,null,null,0,null,0,null,0,null,0]
[null,null,null,null,null,2027,null,null,null,null,null,null,null,null,null,null,null,null,null,null,null,null,null,null,null,null,null,null,null,null,null,null,null,null,null,null,null,null,null,null,null,null,null,null,null,null,null,0,null,0,null,0,null,0]
[null,null,null,null,null,2028,null,null,null,null,null,null,null,null,null,null,null,null,null,null,null,null,null,null,null,null,null,null,null,null,null,null,null,null,null,null,null,null,null,null,null,null,null,null,null,null,null,0,null,0,null,0,null,0]
[null,"Entrance Ramp Data for Travel in Decreasing Milepost Dir.",null,null,null,"Year"]
[null,"Average daily traffic (AADTe,ent) by year, veh/d:",null,null,null,2005,13093,null,13093,null,4560,null,2912,null,null,null,null,null,null,null,null,null,null,null,null,null,null,null,null,null,null,null,null,null,null,null,null,null,null,null,null,null,null,null,null,null,null,13093,null,13093,null,4560,null,2912]
[null," (enter data only for those years for which",null,null,null,2006,null,null,null,null,null,null,null,null,null,null,null,null,null,null,null,null,null,null,null,null,null,null,null,null,null,null,null,null,null,null,null,null,null,null,null,null,null,null,null,null,null,0,null,0,null,0,null,0]
[null,"  it is available, leave other years blank)",null,null,null,2007,null,null,null,null,null,null,null,null,null,null,null,null,null,null,null,null,null,null,null,null,null,null,null,null,null,null,null,null,null,null,null,null,null,null,null,null,null,null,null,null,null,0,null,0,null,0,null,0]
[null,null,null,null,null,2008,null,null,null,null,null,null,null,null,null,null,null,null,null,null,null,null,null,null,null,null,null,null,null,null,null,null,null,null,null,null,null,null,null,null,null,null,null,null,null,null,null,0,null,0,null,0,null,0]
[null,null,null,null,null,2009,null,null,null,null,null,null,null,null,null,null,null,null,null,null,null,null,null,null,null,null,null,null,null,null,null,null,null,null,null,null,null,null,null,null,null,null,null,null,null,null,null,0,null,0,null,0,null,0]
[null,null,null,null,null,2010,null,null,null,null,null,null,null,null,null,null,null,null,null,null,null,null,null,null,null,null,null,null,null,null,null,null,null,null,null,null,null,null,null,null,null,null,null,null,null,null,null,0,null,0,null,0,null,0]
[null,null,null,null,null,2011,null,null,null,null,null,null,null,null,null,null,null,null,null,null,null,null,null,null,null,null,null,null,null,null,null,null,null,null,null,null,null,null,null,null,null,null,null,null,null,null,null,0,null,0,null,0,null,0]
[null,null,null,null,null,2012,null,null,null,null,null,null,null,null,null,null,null,null,null,null,null,null,null,null,null,null,null,null,null,null,null,null,null,null,null,null,null,null,null,null,null,null,null,null,null,null,null,0,null,0,null,0,null,0]
[null,null,null,null,null,2013,null,null,null,null,null,null,null,null,null,null,null,null,null,null,null,null,null,null,null,null,null,null,null,null,null,null,null,null,null,null,null,null,null,null,null,null,null,null,null,null,null,0,null,0,null,0,null,0]
[null,null,null,null,null,2014,null,null,null,null,null,null,null,null,null,null,null,null,null,null,null,null,null,null,null,null,null,null,null,null,null,null,null,null,null,null,null,null,null,null,null,null,null,null,null,null,null,0,null,0,null,0,null,0]
[null,null,null,null,null,2015,null,null,null,null,null,null,null,null,null,null,null,null,null,null,null,null,null,null,null,null,null,null,null,null,null,null,null,null,null,null,null,null,null,null,null,null,null,null,null,null,null,0,null,0,null,0,null,0]
[null,null,null,null,null,2016,null,null,null,null,null,null,null,null,null,null,null,null,null,null,null,null,null,null,null,null,null,null,null,null,null,null,null,null,null,null,null,null,null,null,null,null,null,null,null,null,null,0,null,0,null,0,null,0]
[null,null,null,null,null,2017,null,null,null,null,null,null,null,null,null,null,null,null,null,null,null,null,null,null,null,null,null,null,null,null,null,null,null,null,null,null,null,null,null,null,null,null,null,null,null,null,null,0,null,0,null,0,null,0]
[null,null,null,null,null,2018,null,null,null,null,null,null,null,null,null,null,null,null,null,null,null,null,null,null,null,null,null,null,null,null,null,null,null,null,null,null,null,null,null,null,null,null,null,null,null,null,null,0,null,0,null,0,null,0]
[null,null,null,null,null,2019,null,null,null,null,null,null,null,null,null,null,null,null,null,null,null,null,null,null,null,null,null,null,null,null,null,null,null,null,null,null,null,null,null,null,null,null,null,null,null,null,null,0,null,0,null,0,null,0]
[null,null,null,null,null,{"$f":"F160","v":2020},null,null,null,null,null,null,null,null,null,null,null,null,null,null,null,null,null,null,null,null,null,null,null,null,null,null,null,null,null,null,null,null,null,null,null,null,null,null,null,null,null,0,null,0,null,0,null,0]
[null,null,null,null,null,2021,null,null,null,null,null,null,null,null,null,null,null,null,null,null,null,null,null,null,null,null,null,null,null,null,null,null,null,null,null,null,null,null,null,null,null,null,null,null,null,null,null,0,null,0,null,0,null,0]
[null,null,null,null,null,2022,null,null,null,null,null,null,null,null,null,null,null,null,null,null,null,null,null,null,null,null,null,null,null,null,null,null,null,null,null,null,null,null,null,null,null,null,null,null,null,null,null,0,null,0,null,0,null,0]
[null,null,null,null,null,2023,null,null,null,null,null,null,null,null,null,null,null,null,null,null,null,null,null,null,null,null,null,null,null,null,null,null,null,null,null,null,null,null,null,null,null,null,null,null,null,null,null,0,null,0,null,0,null,0]
[null,null,null,null,null,2024,null,null,null,null,null,null,null,null,null,null,null,null,null,null,null,null,null,null,null,null,null,null,null,null,null,null,null,null,null,null,null,null,null,null,null,null,null,null,null,null,null,0,null,0,null,0,null,0]
[null,null,null,null,null,2025,null,null,null,null,null,null,null,null,null,null,null,null,null,null,null,null,null,null,null,null,null,null,null,null,null,null,null,null,null,null,null,null,null,null,null,null,null,null,null,null,null,0,null,0,null,0,null,0]
[null,null,null,null,null,2026,null,null,null,null,null,null,null,null,null,null,null,null,null,null,null,null,null,null,null,null,null,null,null,null,null,null,null,null,null,null,null,null,null,null,null,null,null,null,null,null,null,0,null,0,null,0,null,0]
[null,null,null,null,null,2027,null,null,null,null,null,null,null,null,null,null,null,null,null,null,null,null,null,null,null,null,null,null,null,null,null,null,null,null,null,null,null,null,null,null,null,null,null,null,null,null,null,0,null,0,null,0,null,0]
[null,null,null,null,null,2028,null,null,null,null,null,null,null,null,null,null,null,null,null,null,null,null,null,null,null,null,null,null,null,null,null,null,null,null,null,null,null,null,null,null,null,null,null,null,null,null,null,0,null,0,null,0,null,0]
[null,"Exit Ramp Data for Travel in Decreasing Milepost Direction",null,null,null,"Year"]
[null,"Average daily traffic (AADTb,ext) by year, veh/d:",null,null,null,2005,null,null,11000,null,null,null,null,null,null,null,null,null,null,null,null,null,null,null,null,null,null,null,null,null,null,null,null,null,null,null,null,null,null,null,null,null,null,null,null,null,null,0,null,11000,null,0,null,0]
[null," (enter data only for those years for which",null,null,null,2006,null,null,null,null,null,null,null,null,null,null,null,null,null,null,null,null,null,null,null,null,null,null,null,null,null,null,null,null,null,null,null,null,null,null,null,null,null,null,null,null,null,0,null,0,null,0,null,0]
[null,"  it is available, leave other years blank)",null,null,null,2007,null,null,null,null,null,null,null,null,null,null,null,null,null,null,null,null,null,null,null,null,null,null,null,null,null,null,null,null,null,null,null,null,null,null,null,null,null,null,null,null,null,0,null,0,null,0,null,0]
[null,null,null,null,null,2008,null,null,null,null,null,null,null,null,null,null,null,null,null,null,null,null,null,null,null,null,null,null,null,null,null,null,null,null,null,null,null,null,null,null,null,null,null,null,null,null,null,0,null,0,null,0,null,0]
[null,null,null,null,null,2009,null,null,null,null,null,null,null,null,null,null,null,null,null,null,null,null,null,null,null,null,null,null,null,null,null,null,null,null,null,null,null,null,null,null,null,null,null,null,null,null,null,0,null,0,null,0,null,0]
[null,null,null,null,null,2010,null,null,null,null,null,null,null,null,null,null,null,null,null,null,null,null,null,null,null,null,null,null,null,null,null,null,null,null,null,null,null,null,null,null,null,null,null,null,null,null,null,0,null,0,null,0,null,0]
[null,null,null,null,null,2011,null,null,null,null,null,null,null,null,null,null,null,null,null,null,null,null,null,null,null,null,null,null,null,null,null,null,null,null,null,null,null,null,null,null,null,null,null,null,null,null,null,0,null,0,null,0,null,0]
[null,null,null,null,null,2012,null,null,null,null,null,null,null,null,null,null,null,null,null,null,null,null,null,null,null,null,null,null,null,null,null,null,null,null,null,null,null,null,null,null,null,null,null,null,null,null,null,0,null,0,null,0,null,0]
[null,null,null,null,null,2013,null,null,null,null,null,null,null,null,null,null,null,null,null,null,null,null,null,null,null,null,null,null,null,null,null,null,null,null,null,null,null,null,null,null,null,null,null,null,null,null,null,0,null,0,null,0,null,0]
[null,null,null,null,null,2014,null,null,null,null,null,null,null,null,null,null,null,null,null,null,null,null,null,null,null,null,null,null,null,null,null,null,null,null,null,null,null,null,null,null,null,null,null,null,null,null,null,0,null,0,null,0,null,0]
[null,null,null,null,null,2015,null,null,null,null,null,null,null,null,null,null,null,null,null,null,null,null,null,null,null,null,null,null,null,null,null,null,null,null,null,null,null,null,null,null,null,null,null,null,null,null,null,0,null,0,null,0,null,0]
[null,null,null,null,null,2016,null,null,null,null,null,null,null,null,null,null,null,null,null,null,null,null,null,null,null,null,null,null,null,null,null,null,null,null,null,null,null,null,null,null,null,null,null,null,null,null,null,0,null,0,null,0,null,0]
[null,null,null,null,null,2017,null,null,null,null,null,null,null,null,null,null,null,null,null,null,null,null,null,null,null,null,null,null,null,null,null,null,null,null,null,null,null,null,null,null,null,null,null,null,null,null,null,0,null,0,null,0,null,0]
[null,null,null,null,null,2018,null,null,null,null,null,null,null,null,null,null,null,null,null,null,null,null,null,null,null,null,null,null,null,null,null,null,null,null,null,null,null,null,null,null,null,null,null,null,null,null,null,0,null,0,null,0,null,0]
[null,null,null,null,null,2019,null,null,null,null,null,null,null,null,null,null,null,null,null,null,null,null,null,null,null,null,null,null,null,null,null,null,null,null,null,null,null,null,null,null,null,null,null,null,null,null,null,0,null,0,null,0,null,0]
[null,null,null,null,null,2020,null,null,null,null,null,null,null,null,null,null,null,null,null,null,null,null,null,null,null,null,null,null,null,null,null,null,null,null,null,null,null,null,null,null,null,null,null,null,null,null,null,0,null,0,null,0,null,0]
[null,null,null,null,null,2021,null,null,null,null,null,null,null,null,null,null,null,null,null,null,null,null,null,null,null,null,null,null,null,null,null,null,null,null,null,null,null,null,null,null,null,null,null,null,null,null,null,0,null,0,null,0,null,0]
[null,null,null,null,null,2022,null,null,null,null,null,null,null,null,null,null,null,null,null,null,null,null,null,null,null,null,null,null,null,null,null,null,null,null,null,null,null,null,null,null,null,null,null,null,null,null,null,0,null,0,null,0,null,0]
[null,null,null,null,null,2023,null,null,null,null,null,null,null,null,null,null,null,null,null,null,null,null,null,null,null,null,null,null,null,null,null,null,null,null,null,null,null,null,null,null,null,null,null,null,null,null,null,0,null,0,null,0,null,0]
[null,null,null,null,null,2024,null,null,null,null,null,null,null,null,null,null,null,null,null,null,null,null,null,null,null,null,null,null,null,null,null,null,null,null,null,null,null,null,null,null,null,null,null,null,null,null,null,0,null,0,null,0,null,0]
[null,null,null,null,null,2025,null,null,null,null,null,null,null,null,null,null,null,null,null,null,null,null,null,null,null,null,null,null,null,null,null,null,null,null,null,null,null,null,null,null,null,null,null,null,null,null,null,0,null,0,null,0,null,0]
[null,null,null,null,null,2026,null,null,null,null,null,null,null,null,null,null,null,null,null,null,null,null,null,null,null,null,null,null,null,null,null,null,null,null,null,null,null,null,null,null,null,null,null,null,null,null,null,0,null,0,null,0,null,0]
[null,null,null,null,null,2027,null,null,null,null,null,null,null,null,null,null,null,null,null,null,null,null,null,null,null,null,null,null,null,null,null,null,null,null,null,null,null,null,null,null,null,null,null,null,null,null,null,0,null,0,null,0,null,0]
[null,null,null,null,null,2028,null,null,null,null,null,null,null,null,null,null,null,null,null,null,null,null,null,null,null,null,null,null,null,null,null,null,null,null,null,null,null,null,null,null,null,null,null,null,null,null,null,0,null,0,null,0,null,0]
[null,"Crash Data",null,null,"Year",{"$f":"IF(Main!$AC$15=TRUE, \"Project Crashes\", \"\")","v":""},"Segment Crashes -->"]
[null,"Count of Fatal-and-Injury (FI) Crashes by Year"]
[null,null,"Multiple-vehicle crashes",null,{"$f":"Main!AC7","v":2005},1,0,null,0,null,0,null,1,null,null,null,null,null,null,null,null,null,null,null,null,null,null,null,null,null,null,null,null,null,null,null,null,null,null,null,null,null,null,null,null,null,null,0,null,0,null,0,null,1]
[null,null,"(not ramp related) (No,fs,n,mv,fi)",null,{"$f":"E221+1","v":2006},3,1,null,0,null,0,null,0,null,null,null,null,null,null,null,null,null,null,null,null,null,null,null,null,null,null,null,null,null,null,null,null,null,null,null,null,null,null,null,null,null,null,1,null,0,null,0,null,0]
[null,null,null,null,{"$f":"E222+1","v":2007},3,1,null,0,null,0,null,0,null,null,null,null,null,null,null,null,null,null,null,null,null,null,null,null,null,null,null,null,null,null,null,null,null,null,null,null,null,null,null,null,null,null,1,null,0,null,0,null,0]
[null,null,null,null,{"$f":"E223+1","v":2008},null,null,null,null,null,null,null,null,null,null,null,null,null,null,null,null,null,null,null,null,null,null,null,null,null,null,null,null,null,null,null,null,null,null,null,null,null,null,null,null,null,null,0,null,0,null,0,null,0]
[null,null,null,null,{"$f":"E224+1","v":2009},null,null,null,null,null,null,null,null,null,null,null,null,null,null,null,null,null,null,null,null,null,null,null,null,null,null,null,null,null,null,null,null,null,null,null,null,null,null,null,null,null,null,0,null,0,null,0,null,0]
[null,null,"Single-vehicle crashes",null,{"$f":"E221","v":2005},null,0,null,0,null,0,null,0,null,null,null,null,null,null,null,null,null,null,null,null,null,null,null,null,null,null,null,null,null,null,null,null,null,null,null,null,null,null,null,null,null,null,0,null,0,null,0,null,0]
[null,null,"(not ramp related) (No,fs,n,sv,fi)",null,2006,null,2,null,0,null,0,null,0,null,null,null,null,null,null,null,null,null,null,null,null,null,null,null,null,null,null,null,null,null,null,null,null,null,null,null,null,null,null,null,null,null,null,2,null,0,null,0,null,0]
[null,null,null,null,2007,null,1,null,0,null,1,null,0,null,null,null,null,null,null,null,null,null,null,null,null,null,null,null,null,null,null,null,null,null,null,null,null,null,null,null,null,null,null,null,null,null,null,1,null,0,null,1,null,0]
[null,null,null,null,2008,null,null,null,null,null,null,null,null,null,null,null,null,null,null,null,null,null,null,null,null,null,null,null,null,null,null,null,null,null,null,null,null,null,null,null,null,null,null,null,null,null,null,0,null,0,null,0,null,0]
[null,null,null,null,2009,null,null,null,null,null,null,null,null,null,null,null,null,null,null,null,null,null,null,null,null,null,null,null,null,null,null,null,null,null,null,null,null,null,null,null,null,null,null,null,null,null,null,0,null,0,null,0,null,0]
[null,null,"Ramp-entrance-related crashes",null,2005,null,0,null,0,null,0,null,0,null,null,null,null,null,null,null,null,null,null,null,null,null,null,null,null,null,null,null,null,null,null,null,null,null,null,null,null,null,null,null,null,null,null,0,null,0,null,0,null,0]
[null,null,"(No,sc,EN,at,fi)",null,2006,null,0,null,0,null,0,null,0,null,null,null,null,null,null,null,null,null,null,null,null,null,null,null,null,null,null,null,null,null,null,null,null,null,null,null,null,null,null,null,null,null,null,0,null,0,null,0,null,0]
[null,null,null,null,2007,null,0,null,0,null,0,null,0,null,null,null,null,null,null,null,null,null,null,null,null,null,null,null,null,null,null,null,null,null,null,null,null,null,null,null,null,null,null,null,null,null,null,0,null,0,null,0,null,0]
[null,null,null,null,2008,null,null,null,null,null,null,null,null,null,null,null,null,null,null,null,null,null,null,null,null,null,null,null,null,null,null,null,null,null,null,null,null,null,null,null,null,null,null,null,null,null,null,0,null,0,null,0,null,0]
[null,null,null,null,2009,null,null,null,null,null,null,null,null,null,null,null,null,null,null,null,null,null,null,null,null,null,null,null,null,null,null,null,null,null,null,null,null,null,null,null,null,null,null,null,null,null,null,0,null,0,null,0,null,0]
[null,null,"Ramp-exit-related crashes",null,2005,null,0,null,0,null,0,null,0,null,null,null,null,null,null,null,null,null,null,null,null,null,null,null,null,null,null,null,null,null,null,null,null,null,null,null,null,null,null,null,null,null,null,0,null,0,null,0,null,0]
[null,null,"(No,sc,EX,at,fi)",null,2006,null,0,null,0,null,0,null,0,null,null,null,null,null,null,null,null,null,null,null,null,null,null,null,null,null,null,null,null,null,null,null,null,null,null,null,null,null,null,null,null,null,null,0,null,0,null,0,null,0]
[null,null,null,null,2007,null,0,null,0,null,0,null,0,null,null,null,null,null,null,null,null,null,null,null,null,null,null,null,null,null,null,null,null,null,null,null,null,null,null,null,null,null,null,null,null,null,null,0,null,0,null,0,null,0]
[null,null,null,null,2008,null,null,null,null,null,null,null,null,null,null,null,null,null,null,null,null,null,null,null,null,null,null,null,null,null,null,null,null,null,null,null,null,null,null,null,null,null,null,null,null,null,null,0,null,0,null,0,null,0]
[null,null,null,null,2009,null,null,null,null,null,null,null,null,null,null,null,null,null,null,null,null,null,null,null,null,null,null,null,null,null,null,null,null,null,null,null,null,null,null,null,null,null,null,null,null,null,null,0,null,0,null,0,null,0]
[null,"Count of Property-Damage-Only (PDO) Crashes by Year"]
[null,null,"Multiple-vehicle crashes",null,{"$f":"E236","v":2005},6,0,null,0,null,2,null,1,null,null,null,null,null,null,null,null,null,null,null,null,null,null,null,null,null,null,null,null,null,null,null,null,null,null,null,null,null,null,null,null,null,null,0,null,0,null,2,null,1]
[null,null,"(not ramp related) (No,fs,n,mv,pdo)",null,{"$f":"E237","v":2006},9,1,null,0,null,3,null,2,null,null,null,null,null,null,null,null,null,null,null,null,null,null,null,null,null,null,null,null,null,null,null,null,null,null,null,null,null,null,null,null,null,null,1,null,0,null,3,null,2]
[null,null,null,null,{"$f":"E238","v":2007},6,0,null,1,null,2,null,1,null,null,null,null,null,null,null,null,null,null,null,null,null,null,null,null,null,null,null,null,null,null,null,null,null,null,null,null,null,null,null,null,null,null,0,null,1,null,2,null,1]
[null,null,null,null,{"$f":"E239","v":2008},null,null,null,null,null,null,null,null,null,null,null,null,null,null,null,null,null,null,null,null,null,null,null,null,null,null,null,null,null,null,null,null,null,null,null,null,null,null,null,null,null,null,0,null,0,null,0,null,0]
[null,null,null,null,{"$f":"E240","v":2009},null,null,null,null,null,null,null,null,null,null,null,null,null,null,null,null,null,null,null,null,null,null,null,null,null,null,null,null,null,null,null,null,null,null,null,null,null,null,null,null,null,null,0,null,0,null,0,null,0]
[null,null,"Single-vehicle crashes",null,{"$f":"E242","v":2005},null,1,null,0,null,0,null,0,null,null,null,null,null,null,null,null,null,null,null,null,null,null,null,null,null,null,null,null,null,null,null,null,null,null,null,null,null,null,null,null,null,null,1,null,0,null,0,null,0]
[null,null,"(not ramp related) (No,fs,n,sv,pdo)",null,2006,null,0,null,0,null,0,null,1,null,null,null,null,null,null,null,null,null,null,null,null,null,null,null,null,null,null,null,null,null,null,null,null,null,null,null,null,null,null,null,null,null,null,0,null,0,null,0,null,1]
[null,null,null,null,2007,null,0,null,0,null,0,null,0,null,null,null,null,null,null,null,null,null,null,null,null,null,null,null,null,null,null,null,null,null,null,null,null,null,null,null,null,null,null,null,null,null,null,0,null,0,null,0,null,0]
[null,null,null,null,2008,null,null,null,null,null,null,null,null,null,null,null,null,null,null,null,null,null,null,null,null,null,null,null,null,null,null,null,null,null,null,null,null,null,null,null,null,null,null,null,null,null,null,0,null,0,null,0,null,0]
[null,null,null,null,2009,null,null,null,null,null,null,null,null,null,null,null,null,null,null,null,null,null,null,null,null,null,null,null,null,null,null,null,null,null,null,null,null,null,null,null,null,null,null,null,null,null,null,0,null,0,null,0,null,0]
[null,null,"Ramp-entrance-related crashes",null,2005,null,0,null,2,null,0,null,0,null,null,null,null,null,null,null,null,null,null,null,null,null,null,null,null,null,null,null,null,null,null,null,null,null,null,null,null,null,null,null,null,null,null,0,null,2,null,0,null,0]
[null,null,"(No,sc,EN,at,pdo)",null,2006,null,0,null,2,null,0,null,0,null,null,null,null,null,null,null,null,null,null,null,null,null,null,null,null,null,null,null,null,null,null,null,null,null,null,null,null,null,null,null,null,null,null,0,null,2,null,0,null,0]
[null,null,null,null,2007,null,0,null,2,null,0,null,0,null,null,null,null,null,null,null,null,null,null,null,null,null,null,null,null,null,null,null,null,null,null,null,null,null,null,null,null,null,null,null,null,null,null,0,null,2,null,0,null,0]
[null,null,null,null,2008,null,null,null,null,null,null,null,null,null,null,null,null,null,null,null,null,null,null,null,null,null,null,null,null,null,null,null,null,null,null,null,null,null,null,null,null,null,null,null,null,null,null,0,null,0,null,0,null,0]
[null,null,null,null,2009,null,null,null,null,null,null,null,null,null,null,null,null,null,null,null,null,null,null,null,null,null,null,null,null,null,null,null,null,null,null,null,null,null,null,null,null,null,null,null,null,null,null,0,null,0,null,0,null,0]
[null,null,"Ramp-exit-related crashes",null,2005,null,0,null,0,null,0,null,0,null,null,null,null,null,null,null,null,null,null,null,null,null,null,null,null,null,null,null,null,null,null,null,null,null,null,null,null,null,null,null,null,null,null,0,null,0,null,0,null,0]
[null,null,"(No,sc,EX,at,pdo)",null,2006,null,0,null,0,null,0,null,0,null,null,null,null,null,null,null,null,null,null,null,null,null,null,null,null,null,null,null,null,null,null,null,null,null,null,null,null,null,null,null,null,null,null,0,null,0,null,0,null,0]
[null,null,null,null,2007,null,0,null,0,null,0,null,0,null,null,null,null,null,null,null,null,null,null,null,null,null,null,null,null,null,null,null,null,null,null,null,null,null,null,null,null,null,null,null,null,null,null,0,null,0,null,0,null,0]
[null,null,null,null,2008,null,null,null,null,null,null,null,null,null,null,null,null,null,null,null,null,null,null,null,null,null,null,null,null,null,null,null,null,null,null,null,null,null,null,null,null,null,null,null,null,null,null,0,null,0,null,0,null,0]
[null,null,null,null,2009,null,null,null,null,null,null,null,null,null,null,null,null,null,null,null,null,null,null,null,null,null,null,null,null,null,null,null,null,null,null,null,null,null,null,null,null,null,null,null,null,null,null,0,null,0,null,0,null,0]
[]
[null,"Advisory Messages"]
[]
[]
[]
[]
[]
[]
[]
[]
[]
[]
[]
[]
[]
[]
[]
[]
[]
[]
[]
[]
[]
[]
[]
[]
[]
[]
[]
[]
[]
[]
[]
[]
[]
[]
[]
[]
[]
[]
[]
[]
[]
[]
[]
[]
[]
[]
[]
[]
[]
[]
[]
[]
[]
[]
[]
[]
[]
[null,"Variable Limits"]
[null,{"$f":"B8","v":"Number of through lanes (n):"},null,null,null,null,{"$f":"IF(Main!$K$6=\"Urban\", 10,8)","v":10},{"$f":"IF(Main!$K$6=\"Urban\", 10,8)","v":10},{"$f":"IF(Main!$K$6=\"Urban\", 10,8)","v":10},{"$f":"IF(Main!$K$6=\"Urban\", 10,8)","v":10},{"$f":"IF(Main!$K$6=\"Urban\", 10,8)","v":10},{"$f":"IF(Main!$K$6=\"Urban\", 10,8)","v":10},{"$f":"IF(Main!$K$6=\"Urban\", 10,8)","v":10},{"$f":"IF(Main!$K$6=\"Urban\", 10,8)","v":10},{"$f":"IF(Main!$K$6=\"Urban\", 10,8)","v":10},{"$f":"IF(Main!$K$6=\"Urban\", 10,8)","v":10},{"$f":"IF(Main!$K$6=\"Urban\", 10,8)","v":10},{"$f":"IF(Main!$K$6=\"Urban\", 10,8)","v":10},{"$f":"IF(Main!$K$6=\"Urban\", 10,8)","v":10},{"$f":"IF(Main!$K$6=\"Urban\", 10,8)","v":10},{"$f":"IF(Main!$K$6=\"Urban\", 10,8)","v":10},{"$f":"IF(Main!$K$6=\"Urban\", 10,8)","v":10},{"$f":"IF(Main!$K$6=\"Urban\", 10,8)","v":10},{"$f":"IF(Main!$K$6=\"Urban\", 10,8)","v":10},{"$f":"IF(Main!$K$6=\"Urban\", 10,8)","v":10},{"$f":"IF(Main!$K$6=\"Urban\", 10,8)","v":10},{"$f":"IF(Main!$K$6=\"Urban\", 10,8)","v":10},{"$f":"IF(Main!$K$6=\"Urban\", 10,8)","v":10},{"$f":"IF(Main!$K$6=\"Urban\", 10,8)","v":10},{"$f":"IF(Main!$K$6=\"Urban\", 10,8)","v":10},{"$f":"IF(Main!$K$6=\"Urban\", 10,8)","v":10},{"$f":"IF(Main!$K$6=\"Urban\", 10,8)","v":10},{"$f":"IF(Main!$K$6=\"Urban\", 10,8)","v":10},{"$f":"IF(Main!$K$6=\"Urban\", 10,8)","v":10},{"$f":"IF(Main!$K$6=\"Urban\", 10,8)","v":10},{"$f":"IF(Main!$K$6=\"Urban\", 10,8)","v":10},{"$f":"IF(Main!$K$6=\"Urban\", 10,8)","v":10},{"$f":"IF(Main!$K$6=\"Urban\", 10,8)","v":10},{"$f":"IF(Main!$K$6=\"Urban\", 10,8)","v":10},{"$f":"IF(Main!$K$6=\"Urban\", 10,8)","v":10},{"$f":"IF(Main!$K$6=\"Urban\", 10,8)","v":10},{"$f":"IF(Main!$K$6=\"Urban\", 10,8)","v":10},{"$f":"IF(Main!$K$6=\"Urban\", 10,8)","v":10},{"$f":"IF(Main!$K$6=\"Urban\", 10,8)","v":10},{"$f":"IF(Main!$K$6=\"Urban\", 10,8)","v":10},{"$f":"IF(Main!$K$6=\"Urban\", 10,8)","v":10}]
[null,{"$f":"C16","v":"Length of curve in segment (Lc1,seg), mi:"},null,null,null,null,{"$f":"MIN(G$10,G15)","v":0.09},{"$f":"MIN(H$10,H15)","v":0},0.05,0,0.08,0,0.23,0.23,0,0,0,0,0,0,0,0,0,0,0,0,0,0,0,0,0,0,0,0,0,0,0,0,0,0,0,0,0,0,0,0]
[null,{"$f":"C20","v":"Length of curve in segment (Lc2,seg), mi:"},null,null,null,null,{"$f":"MIN(G$10,G19)","v":0.09},{"$f":"MIN(H$10,H19)","v":0},0.05,0,0.08,0,0.25,0,0,0,0,0,0,0,0,0,0,0,0,0,0,0,0,0,0,0,0,0,0,0,0,0,0,0,0,0,0,0,0,0]
[null,{"$f":"C24","v":"Length of curve in segment (Lc3,seg), mi:"},null,null,null,null,{"$f":"MIN(G$10,G23)","v":0.09},{"$f":"MIN(H$10,H23)","v":0},0.05,0,0.08,0,0.25,0,0,0,0,0,0,0,0,0,0,0,0,0,0,0,0,0,0,0,0,0,0,0,0,0,0,0,0,0,0,0,0,0]
[null,{"$f":"C69","v":"Length of ramp entrance in segment (Len,seg,inc), mi:"},null,null,null,null,{"$f":"MIN(G$10,G68,0.3)","v":0.09},{"$f":"MIN(H$10,H68,0.3)","v":0},0.05,0.05,0.08,0,0.25,0,0.3,0,0.3,0,0.3,0,0.3,0,0.3,0,0.3,0,0.3,0,0.3,0,0.3,0,0.3,0,0.3,0,0.3,0,0.3,0,0.3,0,0.3,0,0.3,0]
[null,{"$f":"C74","v":"Length of ramp exit in segment (Lex,seg,inc), mi:"},null,null,null,null,{"$f":"IF(G66=\"S-C Lane\", MIN(MAX(0,G$10-G69-0.04), G73, 0.3), MIN(G$10,G73,0.3))","v":0.09},{"$f":"IF(H66=\"S-C Lane\", MIN(MAX(0,H$10-H69-0.04), H73, 0.3), MIN(H$10,H73,0.3))","v":0},0,0,0.08,0,0.25,0,0.3,0,0.3,0,0.3,0,0.3,0,0.3,0,0.3,0,0.3,0,0.3,0,0.3,0,0.3,0,0.3,0,0.3,0,0.3,0,0.3,0,0.3,0,0.3,0]
[null,{"$f":"C78","v":"Length of weaving section in segment (Lwev,seg,inc), mi:"},null,null,null,null,{"$f":"MIN(G$10,G77,0.85)","v":0.09},{"$f":"MIN(H$10,H77,0.85)","v":0},0.05,0,0.08,0.08,0.25,0.25,0.85,0,0.85,0,0.85,0,0.85,0,0.85,0,0.85,0,0.85,0,0.85,0,0.85,0,0.85,0,0.85,0,0.85,0,0.85,0,0.85,0,0.85,0,0.85,0]
[null,{"$f":"C83","v":"Length of ramp entrance in segment (Len,seg,dec), mi:"},null,null,null,null,{"$f":"MIN(G$10,G82,0.3)","v":0.09},{"$f":"MIN(H$10,H82,0.3)","v":0},0.05,0,0.08,0,0.25,0,0.3,0,0.3,0,0.3,0,0.3,0,0.3,0,0.3,0,0.3,0,0.3,0,0.3,0,0.3,0,0.3,0,0.3,0,0.3,0,0.3,0,0.3,0,0.3,0]
[null,{"$f":"C88","v":"Length of ramp exit in segment (Lex,seg,dec), mi:"},null,null,null,null,{"$f":"IF(G80=\"S-C Lane\", MIN(MAX(0,G$10-G83-0.04), G87, 0.3), MIN(G$10,G87,0.3))","v":0.09},{"$f":"IF(H80=\"S-C Lane\", MIN(MAX(0,H$10-H83-0.04), H87, 0.3), MIN(H$10,H87,0.3))","v":0},0.05,0.05,0.08,0,0.25,0,0.3,0,0.3,0,0.3,0,0.3,0,0.3,0,0.3,0,0.3,0,0.3,0,0.3,0,0.3,0,0.3,0,0.3,0,0.3,0,0.3,0,0.3,0,0.3,0]
[null,{"$f":"C92","v":"Length of weaving section in segment (Lwev,seg,dec), mi:"},null,null,null,null,{"$f":"MIN(G$10,G91,0.85)","v":0.09},{"$f":"MIN(H$10,H91,0.85)","v":0},0.05,0,0.08,0,0.25,0,0.85,0,0.85,0,0.85,0,0.85,0,0.85,0,0.85,0,0.85,0,0.85,0,0.85,0,0.85,0,0.85,0,0.85,0,0.85,0,0.85,0,0.85,0,0.85,0]

{"sheet":"Input Ramp Segments","index":4,"n_rows":182,"n_cols":167,"rows_kept":182,"cut":false,"hidden":false,"merged":[[4,166,5,166],[4,162,5,162],[4,163,5,163],[4,164,5,164],[4,165,5,165],[4,156,5,156],[4,157,5,157],[4,158,5,158],[4,159,5,159],[4,160,5,160],[4,161,5,161],[4,150,5,150],[4,151,5,151],[4,152,5,152],[4,153,5,153],[4,154,5,154],[4,155,5,155],[4,144,5,144],[4,145,5,145],[4,146,5,146],[4,147,5,147],[4,148,5,148],[4,149,5,149],[4,138,5,138],[4,139,5,139],[4,140,5,140],[4,141,5,141],[4,142,5,142],[4,143,5,143],[4,132,5,132],[4,133,5,133],[4,134,5,134],[4,135,5,135],[4,136,5,136],[4,137,5,137],[4,126,5,126],[4,127,5,127],[4,128,5,128],[4,129,5,129],[4,130,5,130],[4,131,5,131],[4,120,5,120],[4,121,5,121],[4,122,5,122],[4,123,5,123],[4,124,5,124],[4,125,5,125],[4,114,5,114],[4,115,5,115],[4,116,5,116],[4,117,5,117],[4,118,5,118],[4,119,5,119],[4,108,5,108],[4,109,5,109],[4,110,5,110],[4,111,5,111],[4,112,5,112],[4,113,5,113],[4,102,5,102],[4,103,5,103],[4,104,5,104],[4,105,5,105],[4,106,5,106],[4,107,5,107],[4,96,5,96],[4,97,5,97],[4,98,5,98],[4,99,5,99],[4,100,5,100],[4,101,5,101],[4,90,5,90],[4,91,5,91],[4,92,5,92],[4,93,5,93],[4,94,5,94],[4,95,5,95],[4,88,5,88],[4,89,5,89],[4,6,5,6],[4,7,5,7],[4,8,5,8],[4,9,5,9],[4,10,5,10],[4,11,5,11],[4,12,5,12],[4,13,5,13],[4,14,5,14],[4,15,5,15],[4,42,5,42],[4,43,5,43],[4,52,5,52],[4,53,5,53],[4,54,5,54],[4,55,5,55],[4,48,5,48],[4,49,5,49],[4,50,5,50],[4,51,5,51],[4,60,5,60],[4,61,5,61],[4,62,5,62],[4,63,5,63],[102,5,103,5],[4,87,5,87],[4,20,5,20],[4,21,5,21],[4,22,5,22],[4,23,5,23],[4,16,5,16],[4,17,5,17],[4,18,5,18],[4,19,5,19],[4,28,5,28],[4,29,5,29],[4,30,5,30],[4,31,5,31],[4,24,5,24],[4,25,5,25],[4,26,5,26],[4,27,5,27],[4,36,5,36],[4,37,5,37],[4,38,5,38],[4,39,5,39],[4,32,5,32],[4,33,5,33],[4,34,5,34],[4,35,5,35],[4,44,5,44],[4,45,5,45],[4,46,5,46],[4,47,5,47],[4,40,5,40],[4,41,5,41],[4,56,5,56],[4,57,5,57],[4,58,5,58],[4,59,5,59],[4,68,5,68],[4,69,5,69],[4,70,5,70],[4,71,5,71],[4,64,5,64],[4,65,5,65],[4,66,5,66],[4,67,5,67],[4,76,5,76],[4,77,5,77],[4,78,5,78],[4,79,5,79],[4,72,5,72],[4,73,5,73],[4,74,5,74],[4,75,5,75],[4,84,5,84],[4,85,5,85],[4,80,5,80],[4,81,5,81],[4,82,5,82],[4,83,5,83],[82,6,82,7],[83,6,83,7],[84,6,84,7],[85,6,85,7],[78,6,78,7],[79,6,79,7],[80,6,80,7],[81,6,81,7],[90,6,90,7],[91,6,91,7],[92,6,92,7],[78,8,78,9],[79,8,79,9],[80,8,80,9],[81,8,81,9],[82,14,82,15],[83,14,83,15],[84,14,84,15],[85,14,85,15],[78,14,78,15],[79,14,79,15],[80,14,80,15],[81,14,81,15],[90,14,90,15],[91,14,91,15],[92,14,92,15],[93,6,93,7],[86,6,86,7],[87,6,87,7],[88,6,88,7],[89,6,89,7],[98,6,98,7],[99,6,99,7],[100,6,100,7],[101,6,101,7],[94,6,94,7],[95,6,95,7],[96,6,96,7],[97,6,97,7],[82,8,82,9],[83,8,83,9],[84,8,84,9],[85,8,85,9],[90,8,90,9],[91,8,91,9],[92,8,92,9],[93,8,93,9],[86,8,86,9],[87,8,87,9],[88,8,88,9],[89,8,89,9],[98,8,98,9],[99,8,99,9],[100,8,100,9],[101,8,101,9],[94,8,94,9],[95,8,95,9],[96,8,96,9],[97,12,97,13],[97,8,97,9],[82,10,82,11],[83,10,83,11],[84,10,84,11],[85,10,85,11],[78,10,78,11],[79,10,79,11],[80,10,80,11],[81,10,81,11],[90,10,90,11],[91,10,91,11],[92,10,92,11],[93,10,93,11],[86,10,86,11],[87,10,87,11],[88,10,88,11],[89,10,89,11],[85,16,85,17],[98,10,98,11],[99,10,99,11],[100,10,100,11],[101,10,101,11],[94,10,94,11],[95,10,95,11],[96,10,96,11],[97,10,97,11],[82,12,82,13],[83,12,83,13],[84,12,84,13],[85,12,85,13],[78,12,78,13],[79,12,79,13],[80,12,80,13],[81,12,81,13],[90,12,90,13],[91,12,91,13],[92,12,92,13],[93,12,93,13],[86,12,86,13],[87,12,87,13],[88,12,88,13],[89,12,89,13],[98,12,98,13],[99,12,99,13],[100,12,100,13],[101,12,101,13],[94,12,94,13],[95,12,95,13],[96,12,96,13],[99,16,99,17],[100,16,100,17],[101,16,101,17],[94,16,94,17],[95,16,95,17],[96,16,96,17],[97,16,97,17],[93,14,93,15],[86,14,86,15],[87,14,87,15],[88,14,88,15],[89,14,89,15],[98,14,98,15],[99,14,99,15],[100,14,100,15],[101,14,101,15],[94,14,94,15],[95,14,95,15],[96,14,96,15],[97,14,97,15],[83,18,83,19],[84,18,84,19],[85,18,85,19],[78,18,78,19],[79,18,79,19],[80,18,80,19],[81,18,81,19],[90,18,90,19],[91,18,91,19],[92,18,92,19],[93,18,93,19],[86,18,86,19],[87,18,87,19],[88,18,88,19],[89,18,89,19],[98,18,98,19],[78,16,78,17],[79,16,79,17],[80,16,80,17],[81,16,81,17],[90,16,90,17],[91,16,91,17],[92,16,92,17],[93,16,93,17],[86,16,86,17],[87,16,87,17],[88,16,88,17],[89,16,89,17],[98,16,98,17],[82,16,82,17],[83,16,83,17],[84,16,84,17],[99,18,99,19],[100,18,100,19],[101,18,101,19],[94,18,94,19],[95,18,95,19],[96,18,96,19],[97,18,97,19],[82,20,82,21],[83,20,83,21],[84,20,84,21],[85,20,85,21],[78,20,78,21],[79,20,79,21],[80,20,80,21],[81,20,81,21],[90,20,90,21],[91,20,91,21],[92,20,92,21],[93,20,93,21],[86,20,86,21],[87,20,87,21],[88,20,88,21],[89,20,89,21],[98,20,98,21],[99,20,99,21],[100,20,100,21],[101,20,101,21],[94,20,94,21],[95,20,95,21],[96,20,96,21],[97,20,97,21],[82,18,82,19],[100,22,100,23],[101,22,101,23],[94,22,94,23],[95,22,95,23],[96,22,96,23],[97,22,97,23],[82,24,82,25],[83,24,83,25],[84,24,84,25],[85,24,85,25],[78,24,78,25],[79,24,79,25],[80,24,80,25],[81,24,81,25],[90,24,90,25],[91,24,91,25],[92,24,92,25],[93,24,93,25],[86,24,86,25],[87,24,87,25],[88,24,88,25],[89,24,89,25],[98,24,98,25],[99,24,99,25],[100,24,100,25],[101,24,101,25],[94,24,94,25],[95,24,95,25],[96,24,96,25],[97,24,97,25],[82,22,82,23],[83,22,83,23],[83,26,83,27],[84,26,84,27],[85,26,85,27],[78,26,78,27],[79,26,79,27],[80,26,80,27],[81,26,81,27],[90,26,90,27],[91,26,91,27],[92,26,92,27],[93,26,93,27],[86,26,86,27],[87,26,87,27],[88,26,88,27],[89,26,89,27],[98,26,98,27],[99,22,99,23],[84,22,84,23],[85,22,85,23],[78,22,78,23],[79,22,79,23],[80,22,80,23],[81,22,81,23],[90,22,90,23],[91,22,91,23],[92,22,92,23],[93,22,93,23],[86,22,86,23],[87,22,87,23],[88,22,88,23],[89,22,89,23],[98,22,98,23],[99,26,99,27],[100,26,100,27],[101,26,101,27],[94,26,94,27],[95,26,95,27],[96,26,96,27],[97,26,97,27],[82,28,82,29],[83,28,83,29],[84,28,84,29],[85,28,85,29],[78,28,78,29],[79,28,79,29],[80,28,80,29],[81,28,81,29],[90,28,90,29],[91,28,91,29],[92,28,92,29],[93,28,93,29],[86,28,86,29],[87,28,87,29],[88,28,88,29],[89,28,89,29],[98,28,98,29],[99,28,99,29],[100,28,100,29],[101,28,101,29],[94,28,94,29],[95,28,95,29],[96,28,96,29],[97,28,97,29],[82,26,82,27],[100,30,100,31],[101,30,101,31],[94,30,94,31],[95,30,95,31],[96,30,96,31],[97,30,97,31],[82,32,82,33],[83,32,83,33],[84,32,84,33],[85,32,85,33],[78,32,78,33],[79,32,79,33],[80,32,80,33],[81,32,81,33],[90,32,90,33],[91,32,91,33],[92,32,92,33],[93,32,93,33],[86,32,86,33],[87,32,87,33],[88,32,88,33],[89,32,89,33],[98,32,98,33],[99,32,99,33],[100,32,100,33],[101,32,101,33],[94,32,94,33],[95,32,95,33],[96,32,96,33],[97,32,97,33],[82,30,82,31],[83,30,83,31],[83,34,83,35],[84,34,84,35],[85,34,85,35],[78,34,78,35],[79,34,79,35],[80,34,80,35],[81,34,81,35],[90,34,90,35],[91,34,91,35],[92,34,92,35],[93,34,93,35],[86,34,86,35],[87,34,87,35],[88,34,88,35],[89,34,89,35],[98,34,98,35],[99,30,99,31],[84,30,84,31],[85,30,85,31],[78,30,78,31],[79,30,79,31],[80,30,80,31],[81,30,81,31],[90,30,90,31],[91,30,91,31],[92,30,92,31],[93,30,93,31],[86,30,86,31],[87,30,87,31],[88,30,88,31],[89,30,89,31],[98,30,98,31],[99,34,99,35],[100,34,100,35],[101,34,101,35],[94,34,94,35],[95,34,95,35],[96,34,96,35],[97,34,97,35],[82,36,82,37],[83,36,83,37],[84,36,84,37],[85,36,85,37],[78,36,78,37],[79,36,79,37],[80,36,80,37],[81,36,81,37],[90,36,90,37],[91,36,91,37],[92,36,92,37],[93,36,93,37],[86,36,86,37],[87,36,87,37],[88,36,88,37],[89,36,89,37],[98,36,98,37],[99,36,99,37],[100,36,100,37],[101,36,101,37],[94,36,94,37],[95,36,95,37],[96,36,96,37],[97,36,97,37],[82,34,82,35],[100,38,100,39],[101,38,101,39],[94,38,94,39],[95,38,95,39],[96,38,96,39],[97,38,97,39],[82,40,82,41],[83,40,83,41],[84,40,84,41],[85,40,85,41],[78,40,78,41],[79,40,79,41],[80,40,80,41],[81,40,81,41],[90,40,90,41],[91,40,91,41],[92,40,92,41],[93,40,93,41],[86,40,86,41],[87,40,87,41],[88,40,88,41],[89,40,89,41],[98,40,98,41],[99,40,99,41],[100,40,100,41],[101,40,101,41],[94,40,94,41],[95,40,95,41],[96,40,96,41],[97,40,97,41],[82,38,82,39],[83,38,83,39],[83,42,83,43],[84,42,84,43],[85,42,85,43],[78,42,78,43],[79,42,79,43],[80,42,80,43],[81,42,81,43],[90,42,90,43],[91,42,91,43],[92,42,92,43],[93,42,93,43],[86,42,86,43],[87,42,87,43],[88,42,88,43],[89,42,89,43],[98,42,98,43],[99,38,99,39],[84,38,84,39],[85,38,85,39],[78,38,78,39],[79,38,79,39],[80,38,80,39],[81,38,81,39],[90,38,90,39],[91,38,91,39],[92,38,92,39],[93,38,93,39],[86,38,86,39],[87,38,87,39],[88,38,88,39],[89,38,89,39],[98,38,98,39],[99,42,99,43],[100,42,100,43],[101,42,101,43],[94,42,94,43],[95,42,95,43],[96,42,96,43],[97,42,97,43],[82,44,82,45],[83,44,83,45],[84,44,84,45],[85,44,85,45],[78,44,78,45],[79,44,79,45],[80,44,80,45],[81,44,81,45],[90,44,90,45],[91,44,91,45],[92,44,92,45],[93,44,93,45],[86,44,86,45],[87,44,87,45],[88,44,88,45],[89,44,89,45],[98,44,98,45],[99,44,99,45],[100,44,100,45],[101,44,101,45],[94,44,94,45],[95,44,95,45],[96,44,96,45],[97,44,97,45],[82,42,82,43],[100,46,100,47],[101,46,101,47],[94,46,94,47],[95,46,95,47],[96,46,96,47],[97,46,97,47],[82,48,82,49],[83,48,83,49],[84,48,84,49],[85,48,85,49],[78,48,78,49],[79,48,79,49],[80,48,80,49],[81,48,81,49],[90,48,90,49],[91,48,91,49],[92,48,92,49],[93,48,93,49],[86,48,86,49],[87,48,87,49],[88,48,88,49],[89,48,89,49],[98,48,98,49],[99,48,99,49],[100,48,100,49],[101,48,101,49],[94,48,94,49],[95,48,95,49],[96,48,96,49],[97,48,97,49],[82,46,82,47],[83,46,83,47],[83,50,83,51],[84,50,84,51],[85,50,85,51],[78,50,78,51],[79,50,79,51],[80,50,80,51],[81,50,81,51],[90,50,90,51],[91,50,91,51],[92,50,92,51],[93,50,93,51],[86,50,86,51],[87,50,87,51],[88,50,88,51],[89,50,89,51],[98,50,98,51],[99,46,99,47],[84,46,84,47],[85,46,85,47],[78,46,78,47],[79,46,79,47],[80,46,80,47],[81,46,81,47],[90,46,90,47],[91,46,91,47],[92,46,92,47],[93,46,93,47],[86,46,86,47],[87,46,87,47],[88,46,88,47],[89,46,89,47],[98,46,98,47],[99,50,99,51],[100,50,100,51],[101,50,101,51],[94,50,94,51],[95,50,95,51],[96,50,96,51],[97,50,97,51],[82,52,82,53],[83,52,83,53],[84,52,84,53],[85,52,85,53],[78,52,78,53],[79,52,79,53],[80,52,80,53],[81,52,81,53],[90,52,90,53],[91,52,91,53],[92,52,92,53],[93,52,93,53],[86,52,86,53],[87,52,87,53],[88,52,88,53],[89,52,89,53],[98,52,98,53],[99,52,99,53],[100,52,100,53],[101,52,101,53],[94,52,94,53],[95,52,95,53],[96,52,96,53],[97,52,97,53],[82,50,82,51],[100,54,100,55],[101,54,101,55],[94,54,94,55],[95,54,95,55],[96,54,96,55],[97,54,97,55],[82,56,82,57],[83,56,83,57],[84,56,84,57],[85,56,85,57],[78,56,78,57],[79,56,79,57],[80,56,80,57],[81,56,81,57],[90,56,90,57],[91,56,91,57],[92,56,92,57],[93,56,93,57],[86,56,86,57],[87,56,87,57],[88,56,88,57],[89,56,89,57],[98,56,98,57],[99,56,99,57],[100,56,100,57],[101,56,101,57],[94,56,94,57],[95,56,95,57],[96,56,96,57],[97,56,97,57],[82,54,82,55],[83,54,83,55],[83,58,83,59],[84,58,84,59],[85,58,85,59],[78,58,78,59],[79,58,79,59],[80,58,80,59],[81,58,81,59],[90,58,90,59],[91,58,91,59],[92,58,92,59],[93,58,93,59],[86,58,86,59],[87,58,87,59],[88,58,88,59],[89,58,89,59],[98,58,98,59],[99,54,99,55],[84,54,84,55],[85,54,85,55],[78,54,78,55],[79,54,79,55],[80,54,80,55],[81,54,81,55],[90,54,90,55],[91,54,91,55],[92,54,92,55],[93,54,93,55],[86,54,86,55],[87,54,87,55],[88,54,88,55],[89,54,89,55],[98,54,98,55],[99,58,99,59],[100,58,100,59],[101,58,101,59],[94,58,94,59],[95,58,95,59],[96,58,96,59],[97,58,97,59],[82,60,82,61],[83,60,83,61],[84,60,84,61],[85,60,85,61],[78,60,78,61],[79,60,79,61],[80,60,80,61],[81,60,81,61],[90,60,90,61],[91,60,91,61],[92,60,92,61],[93,60,93,61],[86,60,86,61],[87,60,87,61],[88,60,88,61],[89,60,89,61],[98,60,98,61],[99,60,99,61],[100,60,100,61],[101,60,101,61],[94,60,94,61],[95,60,95,61],[96,60,96,61],[97,60,97,61],[82,58,82,59],[100,62,100,63],[101,62,101,63],[94,62,94,63],[95,62,95,63],[96,62,96,63],[97,62,97,63],[82,64,82,65],[83,64,83,65],[84,64,84,65],[85,64,85,65],[78,64,78,65],[79,64,79,65],[80,64,80,65],[81,64,81,65],[90,64,90,65],[91,64,91,65],[92,64,92,65],[93,64,93,65],[86,64,86,65],[87,64,87,65],[88,64,88,65],[89,64,89,65],[98,64,98,65],[99,64,99,65],[100,64,100,65],[101,64,101,65],[94,64,94,65],[95,64,95,65],[96,64,96,65],[97,64,97,65],[82,62,82,63],[83,62,83,63],[83,66,83,67],[84,66,84,67],[85,66,85,67],[78,66,78,67],[79,66,79,67],[80,66,80,67],[81,66,81,67],[90,66,90,67],[91,66,91,67],[92,66,92,67],[93,66,93,67],[86,66,86,67],[87,66,87,67],[88,66,88,67],[89,66,89,67],[98,66,98,67],[99,62,99,63],[84,62,84,63],[85,62,85,63],[78,62,78,63],[79,62,79,63],[80,62,80,63],[81,62,81,63],[90,62,90,63],[91,62,91,63],[92,62,92,63],[93,62,93,63],[86,62,86,63],[87,62,87,63],[88,62,88,63],[89,62,89,63],[98,62,98,63],[99,66,99,67],[100,66,100,67],[101,66,101,67],[94,66,94,67],[95,66,95,67],[96,66,96,67],[97,66,97,67],[82,68,82,69],[83,68,83,69],[84,68,84,69],[85,68,85,69],[78,68,78,69],[79,68,79,69],[80,68,80,69],[81,68,81,69],[90,68,90,69],[91,68,91,69],[92,68,92,69],[93,68,93,69],[86,68,86,69],[87,68,87,69],[88,68,88,69],[89,68,89,69],[98,68,98,69],[99,68,99,69],[100,68,100,69],[101,68,101,69],[94,68,94,69],[95,68,95,69],[96,68,96,69],[97,68,97,69],[82,66,82,67],[100,70,100,71],[101,70,101,71],[94,70,94,71],[95,70,95,71],[96,70,96,71],[97,70,97,71],[82,72,82,73],[83,72,83,73],[84,72,84,73],[85,72,85,73],[78,72,78,73],[79,72,79,73],[80,72,80,73],[81,72,81,73],[90,72,90,73],[91,72,91,73],[92,72,92,73],[93,72,93,73],[86,72,86,73],[87,72,87,73],[88,72,88,73],[89,72,89,73],[98,72,98,73],[99,72,99,73],[100,72,100,73],[101,72,101,73],[94,72,94,73],[95,72,95,73],[96,72,96,73],[97,72,97,73],[82,70,82,71],[83,70,83,71],[83,74,83,75],[84,74,84,75],[85,74,85,75],[78,74,78,75],[79,74,79,75],[80,74,80,75],[81,74,81,75],[90,74,90,75],[91,74,91,75],[92,74,92,75],[93,74,93,75],[86,74,86,75],[87,74,87,75],[88,74,88,75],[89,74,89,75],[98,74,98,75],[99,70,99,71],[84,70,84,71],[85,70,85,71],[78,70,78,71],[79,70,79,71],[80,70,80,71],[81,70,81,71],[90,70,90,71],[91,70,91,71],[92,70,92,71],[93,70,93,71],[86,70,86,71],[87,70,87,71],[88,70,88,71],[89,70,89,71],[98,70,98,71],[99,74,99,75],[100,74,100,75],[101,74,101,75],[94,74,94,75],[95,74,95,75],[96,74,96,75],[97,74,97,75]],"merged_total":1121,"flags":["merged_cut"]}
[]
[]
[null,null,null,null,"Input Worksheet for Ramp Segments"]
[null,null,null,null,null,null,{"$f":"\"Segment \"& TEXT(INT((COLUMN()-5)/2),\"0\")","v":"Segment 1"},null,{"$f":"\"Segment \"& TEXT(INT((COLUMN()-5)/2),\"0\")","v":"Segment 2"},null,{"$f":"\"Segment \"& TEXT(INT((COLUMN()-5)/2),\"0\")","v":"Segment 3"},null,{"$f":"\"Segment \"& TEXT(INT((COLUMN()-5)/2),\"0\")","v":"Segment 4"},null,{"$f":"\"Segment \"& TEXT(INT((COLUMN()-5)/2),\"0\")","v":"Segment 5"},null,{"$f":"\"Segment \"& TEXT(INT((COLUMN()-5)/2),\"0\")","v":"Segment 6"},null,{"$f":"\"Segment \"& TEXT(INT((COLUMN()-5)/2),\"0\")","v":"Segment 7"},null,{"$f":"\"Segment \"& TEXT(INT((COLUMN()-5)/2),\"0\")","v":"Segment 8"},null,{"$f":"\"Segment \"& TEXT(INT((COLUMN()-5)/2),\"0\")","v":"Segment 9"},null,{"$f":"\"Segment \"& TEXT(INT((COLUMN()-5)/2),\"0\")","v":"Segment 10"},null,{"$f":"\"Segment \"& TEXT(INT((COLUMN()-5)/2),\"0\")","v":"Segment 11"},null,{"$f":"\"Segment \"& TEXT(INT((COLUMN()-5)/2),\"0\")","v":"Segment 12"},null,{"$f":"\"Segment \"& TEXT(INT((COLUMN()-5)/2),\"0\")","v":"Segment 13"},null,{"$f":"\"Segment \"& TEXT(INT((COLUMN()-5)/2),\"0\")","v":"Segment 14"},null,{"$f":"\"Segment \"& TEXT(INT((COLUMN()-5)/2),\"0\")","v":"Segment 15"},null,{"$f":"\"Segment \"& TEXT(INT((COLUMN()-5)/2),\"0\")","v":"Segment 16"},null,{"$f":"\"Segment \"& TEXT(INT((COLUMN()-5)/2),\"0\")","v":"Segment 17"},null,{"$f":"\"Segment \"& TEXT(INT((COLUMN()-5)/2),\"0\")","v":"Segment 18"},null,{"$f":"\"Segment \"& TEXT(INT((COLUMN()-5)/2),\"0\")","v":"Segment 19"},null,{"$f":"\"Segment \"& TEXT(INT((COLUMN()-5)/2),\"0\")","v":"Segment 20"},null,{"$f":"\"Segment \"& TEXT(INT((COLUMN()-5)/2),\"0\")","v":"Segment 21"},null,{"$f":"\"Segment \"& TEXT(INT((COLUMN()-5)/2),\"0\")","v":"Segment 22"},null,{"$f":"\"Segment \"& TEXT(INT((COLUMN()-5)/2),\"0\")","v":"Segment 23"},null,{"$f":"\"Segment \"& TEXT(INT((COLUMN()-5)/2),\"0\")","v":"Segment 24"},null,{"$f":"\"Segment \"& TEXT(INT((COLUMN()-5)/2),\"0\")","v":"Segment 25"},null,{"$f":"\"Segment \"& TEXT(INT((COLUMN()-5)/2),\"0\")","v":"Segment 26"},null,{"$f":"\"Segment \"& TEXT(INT((COLUMN()-5)/2),\"0\")","v":"Segment 27"},null,{"$f":"\"Segment \"& TEXT(INT((COLUMN()-5)/2),\"0\")","v":"Segment 28"},null,{"$f":"\"Segment \"& TEXT(INT((COLUMN()-5)/2),\"0\")","v":"Segment 29"},null,{"$f":"\"Segment \"& TEXT(INT((COLUMN()-5)/2),\"0\")","v":"Segment 30"},null,{"$f":"\"Segment \"& TEXT(INT((COLUMN()-5)/2),\"0\")","v":"Segment 31"},null,{"$f":"\"Segment \"& TEXT(INT((COLUMN()-5)/2),\"0\")","v":"Segment 32"},null,{"$f":"\"Segment \"& TEXT(INT((COLUMN()-5)/2),\"0\")","v":"Segment 33"},null,{"$f":"\"Segment \"& TEXT(INT((COLUMN()-5)/2),\"0\")","v":"Segment 34"},null,{"$f":"\"Segment \"& TEXT(INT((COLUMN()-5)/2),\"0\")","v":"Segment 35"},null,{"$f":"\"Segment \"& TEXT(INT((COLUMN()-5)/2),\"0\")","v":"Segment 36"},null,{"$f":"\"Segment \"& TEXT(INT((COLUMN()-5)/2),\"0\")","v":"Segment 37"},null,{"$f":"\"Segment \"& TEXT(INT((COLUMN()-5)/2),\"0\")","v":"Segment 38"},null,{"$f":"\"Segment \"& TEXT(INT((COLUMN()-5)/2),\"0\")","v":"Segment 39"},null,{"$f":"\"Segment \"& TEXT(INT((COLUMN()-5)/2),\"0\")","v":"Segment 40"},null,null,{"$f":"G4","v":"Segment 1"},null,{"$f":"I4","v":"Segment 2"},null,{"$f":"K4","v":"Segment 3"},null,{"$f":"M4","v":"Segment 4"},null,{"$f":"O4","v":"Segment 5"},null,{"$f":"Q4","v":"Segment 6"},null,{"$f":"S4","v":"Segment 7"},null,{"$f":"U4","v":"Segment 8"},null,{"$f":"W4","v":"Segment 9"},null,{"$f":"Y4","v":"Segment 10"},null,{"$f":"AA4","v":"Segment 11"},null,{"$f":"AC4","v":"Segment 12"},null,{"$f":"AE4","v":"Segment 13"},null,{"$f":"AG4","v":"Segment 14"},null,{"$f":"AI4","v":"Segment 15"},null,{"$f":"AK4","v":"Segment 16"},null,{"$f":"AM4","v":"Segment 17"},null,{"$f":"AO4","v":"Segment 18"},null,{"$f":"AQ4","v":"Segment 19"},null,{"$f":"AS4","v":"Segment 20"},null,{"$f":"AU4","v":"Segment 21"},null,{"$f":"AW4","v":"Segment 22"},null,{"$f":"AY4","v":"Segment 23"},null,{"$f":"BA4","v":"Segment 24"},null,{"$f":"BC4","v":"Segment 25"},null,{"$f":"BE4","v":"Segment 26"},null,{"$f":"BG4","v":"Segment 27"},null,{"$f":"BI4","v":"Segment 28"},null,{"$f":"BK4","v":"Segment 29"},null,{"$f":"BM4","v":"Segment 30"},null,{"$f":"BO4","v":"Segment 31"},null,{"$f":"BQ4","v":"Segment 32"},null,{"$f":"BS4","v":"Segment 33"},null,{"$f":"BU4","v":"Segment 34"},null,{"$f":"BW4","v":"Segment 35"},null,{"$f":"BY4","v":"Segment 36"},null,{"$f":"CA4","v":"Segment 37"},null,{"$f":"CC4","v":"Segment 38"},null,{"$f":"CE4","v":"Segment 39"},null,{"$f":"CG4","v":"Segment 40"}]
[null,null,null,null,null,null,{"$f":"IF(Main!$AG$14=TRUE, \"Crash Period\", \"Study Period\")","v":"Crash Period"},{"$f":"IF(Main!$AG$14=TRUE, \"Study Period\", \"\")","v":"Study Period"},{"$f":"G5","v":"Crash Period"},"Study Period","Crash Period","Study Period","Crash Period","Study Period","Crash Period","Study Period","Crash Period","Study Period","Crash Period","Study Period","Crash Period","Study Period","Crash Period","Study Period","Crash Period","Study Period","Crash Period","Study Period","Crash Period","Study Period","Crash Period","Study Period","Crash Period","Study Period","Crash Period","Study Period","Crash Period","Study Period","Crash Period","Study Period",{"$f":"AM5","v":"Crash Period"},"Study Period","Crash Period","Study Period","Crash Period","Study Period","Crash Period","Study Period","Crash Period","Study Period","Crash Period","Study Period","Crash Period","Study Period","Crash Period","Study Period","Crash Period","Study Period","Crash Period","Study Period","Crash Period","Study Period","Crash Period","Study Period","Crash Period","Study Period","Crash Period","Study Period","Crash Period","Study Period","Crash Period","Study Period",{"$f":"BS5","v":"Crash Period"},"Study Period","Crash Period","Study Period","Crash Period","Study Period","Crash Period","Study Period","Crash Period","Study Period","Crash Period","Study Period","Crash Period","Study Period",null,{"$f":"G5","v":"Crash Period"},{"$f":"H5","v":"Study Period"},{"$f":"I5","v":"Crash Period"},{"$f":"J5","v":"Study Period"},{"$f":"K5","v":"Crash Period"},{"$f":"L5","v":"Study Period"},{"$f":"M5","v":"Crash Period"},{"$f":"N5","v":"Study Period"},{"$f":"O5","v":"Crash Period"},{"$f":"P5","v":"Study Period"},{"$f":"Q5","v":"Crash Period"},{"$f":"R5","v":"Study Period"},{"$f":"S5","v":"Crash Period"},{"$f":"T5","v":"Study Period"},{"$f":"U5","v":"Crash Period"},{"$f":"V5","v":"Study Period"},{"$f":"W5","v":"Crash Period"},{"$f":"X5","v":"Study Period"},{"$f":"Y5","v":"Crash Period"},{"$f":"Z5","v":"Study Period"},{"$f":"AA5","v":"Crash Period"},{"$f":"AB5","v":"Study Period"},{"$f":"AC5","v":"Crash Period"},{"$f":"AD5","v":"Study Period"},{"$f":"AE5","v":"Crash Period"},{"$f":"AF5","v":"Study Period"},{"$f":"AG5","v":"Crash Period"},{"$f":"AH5","v":"Study Period"},{"$f":"AI5","v":"Crash Period"},{"$f":"AJ5","v":"Study Period"},{"$f":"AK5","v":"Crash Period"},{"$f":"AL5","v":"Study Period"},{"$f":"AM5","v":"Crash Period"},{"$f":"AN5","v":"Study Period"},{"$f":"AO5","v":"Crash Period"},{"$f":"AP5","v":"Study Period"},{"$f":"AQ5","v":"Crash Period"},{"$f":"AR5","v":"Study Period"},{"$f":"AS5","v":"Crash Period"},{"$f":"AT5","v":"Study Period"},{"$f":"AU5","v":"Crash Period"},{"$f":"AV5","v":"Study Period"},{"$f":"AW5","v":"Crash Period"},{"$f":"AX5","v":"Study Period"},{"$f":"AY5","v":"Crash Period"},{"$f":"AZ5","v":"Study Period"},{"$f":"BA5","v":"Crash Period"},{"$f":"BB5","v":"Study Period"},{"$f":"BC5","v":"Crash Period"},{"$f":"BD5","v":"Study Period"},{"$f":"BE5","v":"Crash Period"},{"$f":"BF5","v":"Study Period"},{"$f":"BG5","v":"Crash Period"},{"$f":"BH5","v":"Study Period"},{"$f":"BI5","v":"Crash Period"},{"$f":"BJ5","v":"Study Period"},{"$f":"BK5","v":"Crash Period"},{"$f":"BL5","v":"Study Period"},{"$f":"BM5","v":"Crash Period"},{"$f":"BN5","v":"Study Period"},{"$f":"BO5","v":"Crash Period"},{"$f":"BP5","v":"Study Period"},{"$f":"BQ5","v":"Crash Period"},{"$f":"BR5","v":"Study Period"},{"$f":"BS5","v":"Crash Period"},{"$f":"BT5","v":"Study Period"},{"$f":"BU5","v":"Crash Period"},{"$f":"BV5","v":"Study Period"},{"$f":"BW5","v":"Crash Period"},{"$f":"BX5","v":"Study Period"},{"$f":"BY5","v":"Crash Period"},{"$f":"BZ5","v":"Study Period"},{"$f":"CA5","v":"Crash Period"},{"$f":"CB5","v":"Study Period"},{"$f":"CC5","v":"Crash Period"},{"$f":"CD5","v":"Study Period"},{"$f":"CE5","v":"Crash Period"},{"$f":"CF5","v":"Study Period"},{"$f":"CG5","v":"Crash Period"},{"$f":"CH5","v":"Study Period"}]
[null,null,"      (View results in Column CJ)","(View results in Advisory Messages)"]
[null,"Basic Roadway Data"]
[null,"Number of through lanes (n):",null,null,null,null,2,{"$f":"G8","v":2},2,{"$f":"I8","v":2},2,{"$f":"K8","v":2},1,{"$f":"M8","v":1},1,{"$f":"O8","v":1},1,{"$f":"Q8","v":1},null,{"$f":"S8","v":0},null,{"$f":"U8","v":0},null,{"$f":"W8","v":0},null,{"$f":"Y8","v":0},null,{"$f":"AA8","v":0},null,{"$f":"AC8","v":0},null,{"$f":"AE8","v":0},null,{"$f":"AG8","v":0},null,{"$f":"AI8","v":0},null,{"$f":"AK8","v":0},null,{"$f":"AM8","v":0},null,{"$f":"AO8","v":0},null,{"$f":"AQ8","v":0},null,{"$f":"AS8","v":0},null,{"$f":"AU8","v":0},null,{"$f":"AW8","v":0},null,{"$f":"AY8","v":0},null,{"$f":"BA8","v":0},null,{"$f":"BC8","v":0},null,{"$f":"BE8","v":0},null,{"$f":"BG8","v":0},null,{"$f":"BI8","v":0},null,{"$f":"BK8","v":0},null,{"$f":"BM8","v":0},null,{"$f":"BO8","v":0},null,{"$f":"BQ8","v":0},null,{"$f":"BS8","v":0},null,{"$f":"BU8","v":0},null,{"$f":"BW8","v":0},null,{"$f":"BY8","v":0},null,{"$f":"CA8","v":0},null,{"$f":"CC8","v":0},null,{"$f":"CE8","v":0},null,{"$f":"CG8","v":0},null,2,2,2,2,2,2,1,1,1,1,1,1]
[null,"Ramp segment description:",null,null,null,null,"NB exit at Main",null,"SB Exit at Main",null,null,"alt 3",null,null,null,null,null,null,null,null,null,null,null,null,null,null,null,null,null,null,null,null,null,null,null,null,null,null,null,null,null,null,null,null,null,null,null,null,null,null,null,null,null,null,null,null,null,null,null,null,null,null,null,null,null,null,null,null,null,null,null,null,null,null,null,null,null,null,null,null,null,null,null,null,null,null,null,"NB exit at Main",null,"SB Exit at Main",null,null,"alt 3"]
[null,"Segment length (L), mi:",null,null,null,null,0.23,{"$f":"G10","v":0.23},0.06,{"$f":"I10","v":0.06},0.2,{"$f":"K10","v":0.2},0.18,{"$f":"M10","v":0.18},0.1,{"$f":"O10","v":0.1},0.2,{"$f":"Q10","v":0.2},null,{"$f":"S10","v":0},null,{"$f":"U10","v":0},null,{"$f":"W10","v":0},null,{"$f":"Y10","v":0},null,{"$f":"AA10","v":0},null,{"$f":"AC10","v":0},null,{"$f":"AE10","v":0},null,{"$f":"AG10","v":0},null,{"$f":"AI10","v":0},null,{"$f":"AK10","v":0},null,{"$f":"AM10","v":0},null,{"$f":"AO10","v":0},null,{"$f":"AQ10","v":0},null,{"$f":"AS10","v":0},null,{"$f":"AU10","v":0},null,{"$f":"AW10","v":0},null,{"$f":"AY10","v":0},null,{"$f":"BA10","v":0},null,{"$f":"BC10","v":0},null,{"$f":"BE10","v":0},null,{"$f":"BG10","v":0},null,{"$f":"BI10","v":0},null,{"$f":"BK10","v":0},null,{"$f":"BM10","v":0},null,{"$f":"BO10","v":0},null,{"$f":"BQ10","v":0},null,{"$f":"BS10","v":0},null,{"$f":"BU10","v":0},null,{"$f":"BW10","v":0},null,{"$f":"BY10","v":0},null,{"$f":"CA10","v":0},null,{"$f":"CC10","v":0},null,{"$f":"CE10","v":0},null,{"$f":"CG10","v":0},null,0.23000000417232513,0.23000000417232513,5.9999998658895493E-2,5.9999998658895493E-2,0.20000000298023224,0.20000000298023224,0.18000000715255737,0.18000000715255737,0.10000000149011612,0.10000000149011612,0.20000000298023224,0.20000000298023224]
[null,"Average traffic speed on the freeway (Vfrwy), mi/h:",null,null,null,null,70,{"$f":"G11","v":70},70,{"$f":"I11","v":70},70,{"$f":"K11","v":70},70,{"$f":"M11","v":70},70,{"$f":"O11","v":70},70,{"$f":"Q11","v":70},null,{"$f":"S11","v":0},null,{"$f":"U11","v":0},null,{"$f":"W11","v":0},null,{"$f":"Y11","v":0},null,{"$f":"AA11","v":0},null,{"$f":"AC11","v":0},null,{"$f":"AE11","v":0},null,{"$f":"AG11","v":0},null,{"$f":"AI11","v":0},null,{"$f":"AK11","v":0},null,{"$f":"AM11","v":0},null,{"$f":"AO11","v":0},null,{"$f":"AQ11","v":0},null,{"$f":"AS11","v":0},null,{"$f":"AU11","v":0},null,{"$f":"AW11","v":0},null,{"$f":"AY11","v":0},null,{"$f":"BA11","v":0},null,{"$f":"BC11","v":0},null,{"$f":"BE11","v":0},null,{"$f":"BG11","v":0},null,{"$f":"BI11","v":0},null,{"$f":"BK11","v":0},null,{"$f":"BM11","v":0},null,{"$f":"BO11","v":0},null,{"$f":"BQ11","v":0},null,{"$f":"BS11","v":0},null,{"$f":"BU11","v":0},null,{"$f":"BW11","v":0},null,{"$f":"BY11","v":0},null,{"$f":"CA11","v":0},null,{"$f":"CC11","v":0},null,{"$f":"CE11","v":0},null,{"$f":"CG11","v":0},null,70,70,70,70,70,70,70,70,70,70,70,70]
[null,"Segment type (ramp or collector-distributor road):",null,null,null,null,"Exit",{"$f":"G12","v":"Exit"},"Exit",{"$f":"I12","v":"Exit"},"Entrance",{"$f":"K12","v":"Entrance"},"C-D Road",{"$f":"M12","v":"C-D Road"},"Exit",{"$f":"O12","v":"Exit"},"Entrance",{"$f":"Q12","v":"Entrance"},null,{"$f":"S12","v":0},null,{"$f":"U12","v":0},null,{"$f":"W12","v":0},null,{"$f":"Y12","v":0},null,{"$f":"AA12","v":0},null,{"$f":"AC12","v":0},null,{"$f":"AE12","v":0},null,{"$f":"AG12","v":0},null,{"$f":"AI12","v":0},null,{"$f":"AK12","v":0},null,{"$f":"AM12","v":0},null,{"$f":"AO12","v":0},null,{"$f":"AQ12","v":0},null,{"$f":"AS12","v":0},null,{"$f":"AU12","v":0},null,{"$f":"AW12","v":0},null,{"$f":"AY12","v":0},null,{"$f":"BA12","v":0},null,{"$f":"BC12","v":0},null,{"$f":"BE12","v":0},null,{"$f":"BG12","v":0},null,{"$f":"BI12","v":0},null,{"$f":"BK12","v":0},null,{"$f":"BM12","v":0},null,{"$f":"BO12","v":0},null,{"$f":"BQ12","v":0},null,{"$f":"BS12","v":0},null,{"$f":"BU12","v":0},null,{"$f":"BW12","v":0},null,{"$f":"BY12","v":0},null,{"$f":"CA12","v":0},null,{"$f":"CC12","v":0},null,{"$f":"CE12","v":0},null,{"$f":"CG12","v":0},null,"Exit","Exit","Exit","Exit","Entrance","Entrance","C-D Road","C-D Road","Exit","Exit","Entrance","Entrance"]
[null,"Type of control at crossroad ramp terminal:",null,null,null,null,"None",{"$f":"G13","v":"None"},"None",{"$f":"I13","v":"None"},"Stop",{"$f":"K13","v":"Stop"},null,{"$f":"M13","v":0},"Stop",{"$f":"O13","v":"Stop"},"Stop",{"$f":"Q13","v":"Stop"},null,{"$f":"S13","v":0},null,{"$f":"U13","v":0},null,{"$f":"W13","v":0},null,{"$f":"Y13","v":0},null,{"$f":"AA13","v":0},null,{"$f":"AC13","v":0},null,{"$f":"AE13","v":0},null,{"$f":"AG13","v":0},null,{"$f":"AI13","v":0},null,{"$f":"AK13","v":0},null,{"$f":"AM13","v":0},null,{"$f":"AO13","v":0},null,{"$f":"AQ13","v":0},null,{"$f":"AS13","v":0},null,{"$f":"AU13","v":0},null,{"$f":"AW13","v":0},null,{"$f":"AY13","v":0},null,{"$f":"BA13","v":0},null,{"$f":"BC13","v":0},null,{"$f":"BE13","v":0},null,{"$f":"BG13","v":0},null,{"$f":"BI13","v":0},null,{"$f":"BK13","v":0},null,{"$f":"BM13","v":0},null,{"$f":"BO13","v":0},null,{"$f":"BQ13","v":0},null,{"$f":"BS13","v":0},null,{"$f":"BU13","v":0},null,{"$f":"BW13","v":0},null,{"$f":"BY13","v":0},null,{"$f":"CA13","v":0},null,{"$f":"CC13","v":0},null,{"$f":"CE13","v":0},null,{"$f":"CG13","v":0},null,"None","None","None","None","Stop","Stop",null,null,"Stop","Stop","Stop","Stop"]
[null,"Alignment Data"]
[null,"Horizontal Curve Data ",null,null,"    See notes"]
[null,1,"Horizontal curve?:",null,null,null,"In Seg.",{"$f":"G16","v":"In Seg."},"Off Seg.",{"$f":"I16","v":"Off Seg."},"In Seg.",{"$f":"K16","v":"In Seg."},"No",{"$f":"M16","v":"No"},"Off Seg.",{"$f":"O16","v":"Off Seg."},"In Seg.",{"$f":"Q16","v":"In Seg."},null,{"$f":"S16","v":0},null,{"$f":"U16","v":0},null,{"$f":"W16","v":0},null,{"$f":"Y16","v":0},null,{"$f":"AA16","v":0},null,{"$f":"AC16","v":0},null,{"$f":"AE16","v":0},null,{"$f":"AG16","v":0},null,{"$f":"AI16","v":0},null,{"$f":"AK16","v":0},null,{"$f":"AM16","v":0},null,{"$f":"AO16","v":0},null,{"$f":"AQ16","v":0},null,{"$f":"AS16","v":0},null,{"$f":"AU16","v":0},null,{"$f":"AW16","v":0},null,{"$f":"AY16","v":0},null,{"$f":"BA16","v":0},null,{"$f":"BC16","v":0},null,{"$f":"BE16","v":0},null,{"$f":"BG16","v":0},null,{"$f":"BI16","v":0},null,{"$f":"BK16","v":0},null,{"$f":"BM16","v":0},null,{"$f":"BO16","v":0},null,{"$f":"BQ16","v":0},null,{"$f":"BS16","v":0},null,{"$f":"BU16","v":0},null,{"$f":"BW16","v":0},null,{"$f":"BY16","v":0},null,{"$f":"CA16","v":0},null,{"$f":"CC16","v":0},null,{"$f":"CE16","v":0},null,{"$f":"CG16","v":0},null,"In Seg.","In Seg.","Off Seg.","Off Seg.","In Seg.","In Seg.","No","No","Off Seg.","Off Seg.","In Seg.","In Seg."]
[null,null,"Curve radius (R1), ft:",null,null,null,3591,3591,3591,3591,521,521,null,0,1000,1000,500,500,null,0,null,0,null,0,null,0,null,0,null,0,null,0,null,0,null,0,null,0,null,0,null,0,null,0,null,0,null,0,null,0,null,0,null,0,null,0,null,0,null,0,null,0,null,0,null,0,null,0,null,0,null,0,null,0,null,0,null,0,null,0,null,0,null,0,null,0,null,3591,3591,3591,3591,521,521,0,0,1000,1000,500,500]
[null,null,"Length of curve (Lc1), mi:",null,null,null,0.101136,0.101136,0.101136,0.101136,4.6780000000000002E-2,4.6780000000000002E-2,null,0,9.9169999999999994E-2,9.9169999999999994E-2,4.9599999999999998E-2,4.9599999999999998E-2,null,0,null,0,null,0,null,0,null,0,null,0,null,0,null,0,null,0,null,0,null,0,null,0,null,0,null,0,null,0,null,0,null,0,null,0,null,0,null,0,null,0,null,0,null,0,null,0,null,0,null,0,null,0,null,0,null,0,null,0,null,0,null,0,null,0,null,0,null,0.10113599896430969,0.10113599896430969,0.10113599896430969,0.10113599896430969,4.6780001372098923E-2,4.6780001372098923E-2,0,0,9.9169999361038208E-2,9.9169999361038208E-2,4.960000142455101E-2,4.960000142455101E-2]
[null,null,"Length of curve in segment (Lc1,seg), mi:",null,null,null,5.1136000000000001E-2,5.1136000000000001E-2,null,0,4.6780000000000002E-2,4.6780000000000002E-2,null,0,null,0,4.9599999999999998E-2,4.9599999999999998E-2,null,0,null,0,null,0,null,0,null,0,null,0,null,0,null,0,null,0,null,0,null,0,null,0,null,0,null,0,null,0,null,0,null,0,null,0,null,0,null,0,null,0,null,0,null,0,null,0,null,0,null,0,null,0,null,0,null,0,null,0,null,0,null,0,null,0,null,0,null,5.1135998219251633E-2,5.1135998219251633E-2,0,0,4.6780001372098923E-2,4.6780001372098923E-2,0,0,0,0,4.960000142455101E-2,4.960000142455101E-2]
[null,null,"Ramp-mile of beginning of curve in direction of travel (X1), mi:",null,null,null,0.05,0.05,0.05,0.05,0.03,0.03,null,0,0.12,0.12,0.02,0.02,null,0,null,0,null,0,null,0,null,0,null,0,null,0,null,0,null,0,null,0,null,0,null,0,null,0,null,0,null,0,null,0,null,0,null,0,null,0,null,0,null,0,null,0,null,0,null,0,null,0,null,0,null,0,null,0,null,0,null,0,null,0,null,0,null,0,null,0,null,5.000000074505806E-2,5.000000074505806E-2,5.000000074505806E-2,5.000000074505806E-2,2.9999999329447746E-2,2.9999999329447746E-2,0,0,0.11999999731779099,0.11999999731779099,1.9999999552965164E-2,1.9999999552965164E-2]
[null,2,"Horizontal curve?:",null,null,null,"No","No","In Seg.","In Seg.","In Seg.","In Seg.","No","No","In Seg.","In Seg.","In Seg.","In Seg.",null,0,null,0,null,0,null,0,null,0,null,0,null,0,null,0,null,0,null,0,null,0,null,0,null,0,null,0,null,0,null,0,null,0,null,0,null,0,null,0,null,0,null,0,null,0,null,0,null,0,null,0,null,0,null,0,null,0,null,0,null,0,null,0,null,0,null,0,null,"No","No","In Seg.","In Seg.","In Seg.","In Seg.",null,null,"In Seg.","In Seg.","In Seg.","In Seg."]
[null,null,"Curve radius (R2), ft:",null,null,null,null,0,710,710,1990,1990,null,0,500,500,1000,1000,null,0,null,0,null,0,null,0,null,0,null,0,null,0,null,0,null,0,null,0,null,0,null,0,null,0,null,0,null,0,null,0,null,0,null,0,null,0,null,0,null,0,null,0,null,0,null,0,null,0,null,0,null,0,null,0,null,0,null,0,null,0,null,0,null,0,null,0,null,0,0,710,710,1990,1990,0,0,500,500,1000,1000]
[null,null,"Length of curve (Lc2), mi:",null,null,null,null,0,0.30470000000000003,0.30470000000000003,9.1859999999999997E-2,9.1859999999999997E-2,null,0,4.9599999999999998E-2,4.9599999999999998E-2,9.9169999999999994E-2,9.9169999999999994E-2,null,0,null,0,null,0,null,0,null,0,null,0,null,0,null,0,null,0,null,0,null,0,null,0,null,0,null,0,null,0,null,0,null,0,null,0,null,0,null,0,null,0,null,0,null,0,null,0,null,0,null,0,null,0,null,0,null,0,null,0,null,0,null,0,null,0,null,0,null,0,0,0.30469998717308044,0.30469998717308044,9.1859996318817139E-2,9.1859996318817139E-2,0,0,4.960000142455101E-2,4.960000142455101E-2,9.9169999361038208E-2,9.9169999361038208E-2]
[null,null,"Length of curve in segment (Lc2,seg), mi:",null,null,null,null,0,0.05,0.05,9.1859999999999997E-2,9.1859999999999997E-2,null,0,4.9599999999999998E-2,4.9599999999999998E-2,9.9169999999999994E-2,9.9169999999999994E-2,null,0,null,0,null,0,null,0,null,0,null,0,null,0,null,0,null,0,null,0,null,0,null,0,null,0,null,0,null,0,null,0,null,0,null,0,null,0,null,0,null,0,null,0,null,0,null,0,null,0,null,0,null,0,null,0,null,0,null,0,null,0,null,0,null,0,null,0,null,0,0,5.000000074505806E-2,5.000000074505806E-2,9.1859996318817139E-2,9.1859996318817139E-2,0,0,4.960000142455101E-2,4.960000142455101E-2,9.9169999361038208E-2,9.9169999361038208E-2]
[null,null,"Ramp-mile of beginning of curve in direction of travel (X2), mi:",null,null,null,null,0,0.24199999999999999,0.24199999999999999,0.1,0.1,null,0,0.25,0.25,0.1,0.1,null,0,null,0,null,0,null,0,null,0,null,0,null,0,null,0,null,0,null,0,null,0,null,0,null,0,null,0,null,0,null,0,null,0,null,0,null,0,null,0,null,0,null,0,null,0,null,0,null,0,null,0,null,0,null,0,null,0,null,0,null,0,null,0,null,0,null,0,null,0,0,0.24199999868869781,0.24199999868869781,0.10000000149011612,0.10000000149011612,0,0,0.25,0.25,0.10000000149011612,0.10000000149011612]
[null,3,"Horizontal curve?:",null,null,null,"No","No","No","No","No","No","No","No","No","No","No","No",null,0,null,0,null,0,null,0,null,0,null,0,null,0,null,0,null,0,null,0,null,0,null,0,null,0,null,0,null,0,null,0,null,0,null,0,null,0,null,0,null,0,null,0,null,0,null,0,null,0,null,0,null,0,null,0,null,0,null,0,null,0,null,0,null,0,null,0,null,null,null,"No","No","No","No",null,null,"No","No","No","No"]
[null,null,"Curve radius (R3), ft:",null,null,null,null,0,null,0,null,0,null,0,null,0,null,0,null,0,null,0,null,0,null,0,null,0,null,0,null,0,null,0,null,0,null,0,null,0,null,0,null,0,null,0,null,0,null,0,null,0,null,0,null,0,null,0,null,0,null,0,null,0,null,0,null,0,null,0,null,0,null,0,null,0,null,0,null,0,null,0,null,0,null,0,null,0,0,0,0,0,0,0,0,0,0,0,0]
[null,null,"Length of curve (Lc3), mi:",null,null,null,null,0,null,0,null,0,null,0,null,0,null,0,null,0,null,0,null,0,null,0,null,0,null,0,null,0,null,0,null,0,null,0,null,0,null,0,null,0,null,0,null,0,null,0,null,0,null,0,null,0,null,0,null,0,null,0,null,0,null,0,null,0,null,0,null,0,null,0,null,0,null,0,null,0,null,0,null,0,null,0,null,0,0,0,0,0,0,0,0,0,0,0,0]
[null,null,"Length of curve in segment (Lc3,seg), mi:",null,null,null,null,0,null,0,null,0,null,0,null,0,null,0,null,0,null,0,null,0,null,0,null,0,null,0,null,0,null,0,null,0,null,0,null,0,null,0,null,0,null,0,null,0,null,0,null,0,null,0,null,0,null,0,null,0,null,0,null,0,null,0,null,0,null,0,null,0,null,0,null,0,null,0,null,0,null,0,null,0,null,0,null,0,0,0,0,0,0,0,0,0,0,0,0]
[null,null,"Ramp-mile of beginning of curve in direction of travel (X3), mi:",null,null,null,null,0,null,0,null,0,null,0,null,0,null,0,null,0,null,0,null,0,null,0,null,0,null,0,null,0,null,0,null,0,null,0,null,0,null,0,null,0,null,0,null,0,null,0,null,0,null,0,null,0,null,0,null,0,null,0,null,0,null,0,null,0,null,0,null,0,null,0,null,0,null,0,null,0,null,0,null,0,null,0,null,0,0,0,0,0,0,0,0,0,0,0,0]
[null,4,"Horizontal curve?:",null,null,null,"No","No","No","No","No","No","No","No","No","No","No","No",null,0,null,0,null,0,null,0,null,0,null,0,null,0,null,0,null,0,null,0,null,0,null,0,null,0,null,0,null,0,null,0,null,0,null,0,null,0,null,0,null,0,null,0,null,0,null,0,null,0,null,0,null,0,null,0,null,0,null,0,null,0,null,0,null,0,null,0]
[null,null,"Curve radius (R4), ft:",null,null,null,null,0,null,0,null,0,null,0,null,0,null,0,null,0,null,0,null,0,null,0,null,0,null,0,null,0,null,0,null,0,null,0,null,0,null,0,null,0,null,0,null,0,null,0,null,0,null,0,null,0,null,0,null,0,null,0,null,0,null,0,null,0,null,0,null,0,null,0,null,0,null,0,null,0,null,0,null,0,null,0,null,0,0,0,0,0,0,0,0,0,0,0,0]
[null,null,"Length of curve (Lc4), mi:",null,null,null,null,0,null,0,null,0,null,0,null,0,null,0,null,0,null,0,null,0,null,0,null,0,null,0,null,0,null,0,null,0,null,0,null,0,null,0,null,0,null,0,null,0,null,0,null,0,null,0,null,0,null,0,null,0,null,0,null,0,null,0,null,0,null,0,null,0,null,0,null,0,null,0,null,0,null,0,null,0,null,0,null,0,0,0,0,0,0,0,0,0,0,0,0]
[null,null,"Length of curve in segment (Lc4,seg), mi:",null,null,null,null,0,null,0,null,0,null,0,null,0,null,0,null,0,null,0,null,0,null,0,null,0,null,0,null,0,null,0,null,0,null,0,null,0,null,0,null,0,null,0,null,0,null,0,null,0,null,0,null,0,null,0,null,0,null,0,null,0,null,0,null,0,null,0,null,0,null,0,null,0,null,0,null,0,null,0,null,0,null,0,null,0,0,0,0,0,0,0,0,0,0,0,0]
[null,null,"Ramp-mile of beginning of curve in direction of travel (X4), mi:",null,null,null,null,0,null,0,null,0,null,0,null,0,null,0,null,0,null,0,null,0,null,0,null,0,null,0,null,0,null,0,null,0,null,0,null,0,null,0,null,0,null,0,null,0,null,0,null,0,null,0,null,0,null,0,null,0,null,0,null,0,null,0,null,0,null,0,null,0,null,0,null,0,null,0,null,0,null,0,null,0,null,0,null,0,0,0,0,0,0,0,0,0,0,0,0]
[null,5,"Horizontal curve?:",null,null,null,"No","No","No","No","No","No","No","No","No","No","No","No",null,0,null,0,null,0,null,0,null,0,null,0,null,0,null,0,null,0,null,0,null,0,null,0,null,0,null,0,null,0,null,0,null,0,null,0,null,0,null,0,null,0,null,0,null,0,null,0,null,0,null,0,null,0,null,0,null,0,null,0,null,0,null,0,null,0,null,0]
[null,null,"Curve radius (R5), ft:",null,null,null,null,0,null,0,null,0,null,0,null,0,null,0,null,0,null,0,null,0,null,0,null,0,null,0,null,0,null,0,null,0,null,0,null,0,null,0,null,0,null,0,null,0,null,0,null,0,null,0,null,0,null,0,null,0,null,0,null,0,null,0,null,0,null,0,null,0,null,0,null,0,null,0,null,0,null,0,null,0,null,0,null,0,0,0,0,0,0,0,0,0,0,0,0]
[null,null,"Length of curve (Lc5), mi:",null,null,null,null,0,null,0,null,0,null,0,null,0,null,0,null,0,null,0,null,0,null,0,null,0,null,0,null,0,null,0,null,0,null,0,null,0,null,0,null,0,null,0,null,0,null,0,null,0,null,0,null,0,null,0,null,0,null,0,null,0,null,0,null,0,null,0,null,0,null,0,null,0,null,0,null,0,null,0,null,0,null,0,null,0,0,0,0,0,0,0,0,0,0,0,0]
[null,null,"Length of curve in segment (Lc5,seg), mi:",null,null,null,null,0,null,0,null,0,null,0,null,0,null,0,null,0,null,0,null,0,null,0,null,0,null,0,null,0,null,0,null,0,null,0,null,0,null,0,null,0,null,0,null,0,null,0,null,0,null,0,null,0,null,0,null,0,null,0,null,0,null,0,null,0,null,0,null,0,null,0,null,0,null,0,null,0,null,0,null,0,null,0,null,0,0,0,0,0,0,0,0,0,0,0,0]
[null,null,"Ramp-mile of beginning of curve in direction of travel (X5), mi:",null,null,null,null,0,null,0,null,0,null,0,null,0,null,0,null,0,null,0,null,0,null,0,null,0,null,0,null,0,null,0,null,0,null,0,null,0,null,0,null,0,null,0,null,0,null,0,null,0,null,0,null,0,null,0,null,0,null,0,null,0,null,0,null,0,null,0,null,0,null,0,null,0,null,0,null,0,null,0,null,0,null,0,null,0,0,0,0,0,0,0,0,0,0,0,0]
[null,"Cross Section Data"]
[null,"Lane width (Wl), ft:",null,null,null,null,12,{"$f":"G42","v":12},12,11,11.9,{"$f":"K42","v":11.9},12,{"$f":"M42","v":12},12,{"$f":"O42","v":12},12,{"$f":"Q42","v":12},null,{"$f":"S42","v":0},null,{"$f":"U42","v":0},null,{"$f":"W42","v":0},null,{"$f":"Y42","v":0},null,{"$f":"AA42","v":0},null,{"$f":"AC42","v":0},null,{"$f":"AE42","v":0},null,{"$f":"AG42","v":0},null,{"$f":"AI42","v":0},null,{"$f":"AK42","v":0},null,{"$f":"AM42","v":0},null,{"$f":"AO42","v":0},null,{"$f":"AQ42","v":0},null,{"$f":"AS42","v":0},null,{"$f":"AU42","v":0},null,{"$f":"AW42","v":0},null,{"$f":"AY42","v":0},null,{"$f":"BA42","v":0},null,{"$f":"BC42","v":0},null,{"$f":"BE42","v":0},null,{"$f":"BG42","v":0},null,{"$f":"BI42","v":0},null,{"$f":"BK42","v":0},null,{"$f":"BM42","v":0},null,{"$f":"BO42","v":0},null,{"$f":"BQ42","v":0},null,{"$f":"BS42","v":0},null,{"$f":"BU42","v":0},null,{"$f":"BW42","v":0},null,{"$f":"BY42","v":0},null,{"$f":"CA42","v":0},null,{"$f":"CC42","v":0},null,{"$f":"CE42","v":0},null,{"$f":"CG42","v":0},null,12,12,12,11,11.899999618530273,11.899999618530273,12,12,12,12,12,12]
[null,"Right shoulder width (Wrs), ft:",null,null,null,null,8.3000000000000007,{"$f":"G43","v":8.3000000000000007},8.3000000000000007,{"$f":"I43","v":8.3000000000000007},7.4,{"$f":"K43","v":7.4},6,{"$f":"M43","v":6},8,{"$f":"O43","v":8},8,{"$f":"Q43","v":8},null,{"$f":"S43","v":0},null,{"$f":"U43","v":0},null,{"$f":"W43","v":0},null,{"$f":"Y43","v":0},null,{"$f":"AA43","v":0},null,{"$f":"AC43","v":0},null,{"$f":"AE43","v":0},null,{"$f":"AG43","v":0},null,{"$f":"AI43","v":0},null,{"$f":"AK43","v":0},null,{"$f":"AM43","v":0},null,{"$f":"AO43","v":0},null,{"$f":"AQ43","v":0},null,{"$f":"AS43","v":0},null,{"$f":"AU43","v":0},null,{"$f":"AW43","v":0},null,{"$f":"AY43","v":0},null,{"$f":"BA43","v":0},null,{"$f":"BC43","v":0},null,{"$f":"BE43","v":0},null,{"$f":"BG43","v":0},null,{"$f":"BI43","v":0},null,{"$f":"BK43","v":0},null,{"$f":"BM43","v":0},null,{"$f":"BO43","v":0},null,{"$f":"BQ43","v":0},null,{"$f":"BS43","v":0},null,{"$f":"BU43","v":0},null,{"$f":"BW43","v":0},null,{"$f":"BY43","v":0},null,{"$f":"CA43","v":0},null,{"$f":"CC43","v":0},null,{"$f":"CE43","v":0},null,{"$f":"CG43","v":0},null,8.3000001907348633,8.3000001907348633,8.3000001907348633,8.3000001907348633,7.4000000953674316,7.4000000953674316,6,6,8,8,8,8]
[null,"Left shoulder width (Wls), ft:",null,null,null,null,4.7,{"$f":"G44","v":4.7},4.7,{"$f":"I44","v":4.7},3.7,{"$f":"K44","v":3.7},4,{"$f":"M44","v":4},6,{"$f":"O44","v":6},6,{"$f":"Q44","v":6},null,{"$f":"S44","v":0},null,{"$f":"U44","v":0},null,{"$f":"W44","v":0},null,{"$f":"Y44","v":0},null,{"$f":"AA44","v":0},null,{"$f":"AC44","v":0},null,{"$f":"AE44","v":0},null,{"$f":"AG44","v":0},null,{"$f":"AI44","v":0},null,{"$f":"AK44","v":0},null,{"$f":"AM44","v":0},null,{"$f":"AO44","v":0},null,{"$f":"AQ44","v":0},null,{"$f":"AS44","v":0},null,{"$f":"AU44","v":0},null,{"$f":"AW44","v":0},null,{"$f":"AY44","v":0},null,{"$f":"BA44","v":0},null,{"$f":"BC44","v":0},null,{"$f":"BE44","v":0},null,{"$f":"BG44","v":0},null,{"$f":"BI44","v":0},null,{"$f":"BK44","v":0},null,{"$f":"BM44","v":0},null,{"$f":"BO44","v":0},null,{"$f":"BQ44","v":0},null,{"$f":"BS44","v":0},null,{"$f":"BU44","v":0},null,{"$f":"BW44","v":0},null,{"$f":"BY44","v":0},null,{"$f":"CA44","v":0},null,{"$f":"CC44","v":0},null,{"$f":"CE44","v":0},null,{"$f":"CG44","v":0},null,4.6999998092651367,4.6999998092651367,4.6999998092651367,4.6999998092651367,3.7000000476837158,3.7000000476837158,4,4,6,6,6,6]
[null,"Presence of lane add or lane drop by taper:",null,null,null,null,"No",{"$f":"G45","v":"No"},"Lane Drop",{"$f":"I45","v":"Lane Drop"},"Lane Add",{"$f":"K45","v":"Lane Add"},"No",{"$f":"M45","v":"No"},"No",{"$f":"O45","v":"No"},"No",{"$f":"Q45","v":"No"},null,{"$f":"S45","v":0},null,{"$f":"U45","v":0},null,{"$f":"W45","v":0},null,{"$f":"Y45","v":0},null,{"$f":"AA45","v":0},null,{"$f":"AC45","v":0},null,{"$f":"AE45","v":0},null,{"$f":"AG45","v":0},null,{"$f":"AI45","v":0},null,{"$f":"AK45","v":0},null,{"$f":"AM45","v":0},null,{"$f":"AO45","v":0},null,{"$f":"AQ45","v":0},null,{"$f":"AS45","v":0},null,{"$f":"AU45","v":0},null,{"$f":"AW45","v":0},null,{"$f":"AY45","v":0},null,{"$f":"BA45","v":0},null,{"$f":"BC45","v":0},null,{"$f":"BE45","v":0},null,{"$f":"BG45","v":0},null,{"$f":"BI45","v":0},null,{"$f":"BK45","v":0},null,{"$f":"BM45","v":0},null,{"$f":"BO45","v":0},null,{"$f":"BQ45","v":0},null,{"$f":"BS45","v":0},null,{"$f":"BU45","v":0},null,{"$f":"BW45","v":0},null,{"$f":"BY45","v":0},null,{"$f":"CA45","v":0},null,{"$f":"CC45","v":0},null,{"$f":"CE45","v":0},null,{"$f":"CG45","v":0},null,"No","No","Lane Drop","Lane Drop","Lane Add","Lane Add","No","No","No","No","No","No"]
[null,null,"Length of taper in segment (Ladd,seg or Ldrop,seg), mi:",null,null,null,null,{"$f":"G46","v":0},1.8939999999999999E-2,{"$f":"I46","v":1.8939999999999999E-2},4.7350000000000003E-2,{"$f":"K46","v":4.7350000000000003E-2},null,{"$f":"M46","v":0},null,{"$f":"O46","v":0},null,{"$f":"Q46","v":0},null,{"$f":"S46","v":0},null,{"$f":"U46","v":0},null,{"$f":"W46","v":0},null,{"$f":"Y46","v":0},null,{"$f":"AA46","v":0},null,{"$f":"AC46","v":0},null,{"$f":"AE46","v":0},null,{"$f":"AG46","v":0},null,{"$f":"AI46","v":0},null,{"$f":"AK46","v":0},null,{"$f":"AM46","v":0},null,{"$f":"AO46","v":0},null,{"$f":"AQ46","v":0},null,{"$f":"AS46","v":0},null,{"$f":"AU46","v":0},null,{"$f":"AW46","v":0},null,{"$f":"AY46","v":0},null,{"$f":"BA46","v":0},null,{"$f":"BC46","v":0},null,{"$f":"BE46","v":0},null,{"$f":"BG46","v":0},null,{"$f":"BI46","v":0},null,{"$f":"BK46","v":0},null,{"$f":"BM46","v":0},null,{"$f":"BO46","v":0},null,{"$f":"BQ46","v":0},null,{"$f":"BS46","v":0},null,{"$f":"BU46","v":0},null,{"$f":"BW46","v":0},null,{"$f":"BY46","v":0},null,{"$f":"CA46","v":0},null,{"$f":"CC46","v":0},null,{"$f":"CE46","v":0},null,{"$f":"CG46","v":0},null,null,null,1.8939999863505363E-2,1.8939999863505363E-2,4.7350000590085983E-2,4.7350000590085983E-2]
[null,"Roadside Data"]
[null,"Presence of barrier on right side of roadway:",null,null,null,null,"Yes",{"$f":"G48","v":"Yes"},"Yes",{"$f":"I48","v":"Yes"},"No",{"$f":"K48","v":"No"},"No",{"$f":"M48","v":"No"},"No",{"$f":"O48","v":"No"},"No",{"$f":"Q48","v":"No"},null,{"$f":"S48","v":0},null,{"$f":"U48","v":0},null,{"$f":"W48","v":0},null,{"$f":"Y48","v":0},null,{"$f":"AA48","v":0},null,{"$f":"AC48","v":0},null,{"$f":"AE48","v":0},null,{"$f":"AG48","v":0},null,{"$f":"AI48","v":0},null,{"$f":"AK48","v":0},null,{"$f":"AM48","v":0},null,{"$f":"AO48","v":0},null,{"$f":"AQ48","v":0},null,{"$f":"AS48","v":0},null,{"$f":"AU48","v":0},null,{"$f":"AW48","v":0},null,{"$f":"AY48","v":0},null,{"$f":"BA48","v":0},null,{"$f":"BC48","v":0},null,{"$f":"BE48","v":0},null,{"$f":"BG48","v":0},null,{"$f":"BI48","v":0},null,{"$f":"BK48","v":0},null,{"$f":"BM48","v":0},null,{"$f":"BO48","v":0},null,{"$f":"BQ48","v":0},null,{"$f":"BS48","v":0},null,{"$f":"BU48","v":0},null,{"$f":"BW48","v":0},null,{"$f":"BY48","v":0},null,{"$f":"CA48","v":0},null,{"$f":"CC48","v":0},null,{"$f":"CE48","v":0},null,{"$f":"CG48","v":0},null,"Yes","Yes","Yes","Yes","No","No","No","No","No","No","No","No"]
[null,1,"Length of barrier (Lrb,1), mi:",null,null,null,0.11360000000000001,0.11360000000000001,5.0799999999999998E-2,5.0799999999999998E-2,null,0,null,0,null,0,null,0,null,0,null,0,null,0,null,0,null,0,null,0,null,0,null,0,null,0,null,0,null,0,null,0,null,0,null,0,null,0,null,0,null,0,null,0,null,0,null,0,null,0,null,0,null,0,null,0,null,0,null,0,null,0,null,0,null,0,null,0,null,0,null,0,null,0,null,0,null,0.1136000007390976,0.1136000007390976,5.0799999386072159E-2,5.0799999386072159E-2,0,0,0,0,0,0,0,0]
[null,null,"Distance from edge of traveled way to barrier face (Woff,r,1), ft:",null,null,null,9.6,9.6,9.3000000000000007,9.3000000000000007,null,0,null,0,null,0,null,0,null,0,null,0,null,0,null,0,null,0,null,0,null,0,null,0,null,0,null,0,null,0,null,0,null,0,null,0,null,0,null,0,null,0,null,0,null,0,null,0,null,0,null,0,null,0,null,0,null,0,null,0,null,0,null,0,null,0,null,0,null,0,null,0,null,0,null,0,null,9.6000003814697266,9.6000003814697266,9.3000001907348633,9.3000001907348633,0,0,0,0,0,0,0,0]
[null,2,"Length of barrier (Lrb,2), mi:",null,null,null,9.4700000000000006E-2,9.4700000000000006E-2,null,0,null,0,null,0,null,0,null,0,null,0,null,0,null,0,null,0,null,0,null,0,null,0,null,0,null,0,null,0,null,0,null,0,null,0,null,0,null,0,null,0,null,0,null,0,null,0,null,0,null,0,null,0,null,0,null,0,null,0,null,0,null,0,null,0,null,0,null,0,null,0,null,0,null,0,null,0,null,9.4700001180171967E-2,9.4700001180171967E-2,0,0,0,0,0,0,0,0,0,0]
[null,null,"Distance from edge of traveled way to barrier face (Woff,r,2), ft:",null,null,null,9.6,9.6,null,0,null,0,null,0,null,0,null,0,null,0,null,0,null,0,null,0,null,0,null,0,null,0,null,0,null,0,null,0,null,0,null,0,null,0,null,0,null,0,null,0,null,0,null,0,null,0,null,0,null,0,null,0,null,0,null,0,null,0,null,0,null,0,null,0,null,0,null,0,null,0,null,0,null,0,null,0,null,9.6000003814697266,9.6000003814697266,0,0,0,0,0,0,0,0,0,0]
[null,3,"Length of barrier (Lrb,3), mi:",null,null,null,null,0,null,0,null,0,null,0,null,0,null,0,null,0,null,0,null,0,null,0,null,0,null,0,null,0,null,0,null,0,null,0,null,0,null,0,null,0,null,0,null,0,null,0,null,0,null,0,null,0,null,0,null,0,null,0,null,0,null,0,null,0,null,0,null,0,null,0,null,0,null,0,null,0,null,0,null,0,null,0,null,0,0,0,0,0,0,0,0,0,0,0,0]
[null,null,"Distance from edge of traveled way to barrier face (Woff,r,3), ft:",null,null,null,null,0,null,0,null,0,null,0,null,0,null,0,null,0,null,0,null,0,null,0,null,0,null,0,null,0,null,0,null,0,null,0,null,0,null,0,null,0,null,0,null,0,null,0,null,0,null,0,null,0,null,0,null,0,null,0,null,0,null,0,null,0,null,0,null,0,null,0,null,0,null,0,null,0,null,0,null,0,null,0,null,0,0,0,0,0,0,0,0,0,0,0,0]
[null,4,"Length of barrier (Lrb,4), mi:",null,null,null,null,0,null,0,null,0,null,0,null,0,null,0,null,0,null,0,null,0,null,0,null,0,null,0,null,0,null,0,null,0,null,0,null,0,null,0,null,0,null,0,null,0,null,0,null,0,null,0,null,0,null,0,null,0,null,0,null,0,null,0,null,0,null,0,null,0,null,0,null,0,null,0,null,0,null,0,null,0,null,0,null,0,0,0,0,0,0,0,0,0,0,0,0]
[null,null,"Distance from edge of traveled way to barrier face (Woff,r,4), ft:",null,null,null,null,0,null,0,null,0,null,0,null,0,null,0,null,0,null,0,null,0,null,0,null,0,null,0,null,0,null,0,null,0,null,0,null,0,null,0,null,0,null,0,null,0,null,0,null,0,null,0,null,0,null,0,null,0,null,0,null,0,null,0,null,0,null,0,null,0,null,0,null,0,null,0,null,0,null,0,null,0,null,0,null,0,0,0,0,0,0,0,0,0,0,0,0]
[null,5,"Length of barrier (Lrb,5), mi:",null,null,null,null,0,null,0,null,0,null,0,null,0,null,0,null,0,null,0,null,0,null,0,null,0,null,0,null,0,null,0,null,0,null,0,null,0,null,0,null,0,null,0,null,0,null,0,null,0,null,0,null,0,null,0,null,0,null,0,null,0,null,0,null,0,null,0,null,0,null,0,null,0,null,0,null,0,null,0,null,0,null,0,null,0,0,0,0,0,0,0,0,0,0,0,0]
[null,null,"Distance from edge of traveled way to barrier face (Woff,r,5), ft:",null,null,null,null,0,null,0,null,0,null,0,null,0,null,0,null,0,null,0,null,0,null,0,null,0,null,0,null,0,null,0,null,0,null,0,null,0,null,0,null,0,null,0,null,0,null,0,null,0,null,0,null,0,null,0,null,0,null,0,null,0,null,0,null,0,null,0,null,0,null,0,null,0,null,0,null,0,null,0,null,0,null,0,null,0,0,0,0,0,0,0,0,0,0,0,0]
[null,"Presence of barrier on left side of roadway:",null,null,null,null,"Yes","Yes","Yes","Yes","Yes","Yes","No","No","No","No","No","No",null,0,null,0,null,0,null,0,null,0,null,0,null,0,null,0,null,0,null,0,null,0,null,0,null,0,null,0,null,0,null,0,null,0,null,0,null,0,null,0,null,0,null,0,null,0,null,0,null,0,null,0,null,0,null,0,null,0,null,0,null,0,null,0,null,0,null,0,null,"Yes","Yes","Yes","Yes","Yes","Yes","No","No","No","No","No","No"]
[null,1,"Length of barrier (Llb,1), mi:",null,null,null,3.2200000000000002E-3,3.2200000000000002E-3,2.4049999999999998E-2,2.4049999999999998E-2,0.06,0.06,null,0,null,0,null,0,null,0,null,0,null,0,null,0,null,0,null,0,null,0,null,0,null,0,null,0,null,0,null,0,null,0,null,0,null,0,null,0,null,0,null,0,null,0,null,0,null,0,null,0,null,0,null,0,null,0,null,0,null,0,null,0,null,0,null,0,null,0,null,0,null,0,null,0,null,3.2200000714510679E-3,3.2200000714510679E-3,2.4049999192357063E-2,2.4049999192357063E-2,5.9999998658895493E-2,5.9999998658895493E-2,0,0,0,0,0,0]
[null,null,"Distance from edge of traveled way to barrier face (Woff,l,1), ft:",null,null,null,7.5,7.5,5.7,5.7,6.1,6.1,null,0,null,0,null,0,null,0,null,0,null,0,null,0,null,0,null,0,null,0,null,0,null,0,null,0,null,0,null,0,null,0,null,0,null,0,null,0,null,0,null,0,null,0,null,0,null,0,null,0,null,0,null,0,null,0,null,0,null,0,null,0,null,0,null,0,null,0,null,0,null,0,null,0,null,7.5,7.5,5.6999998092651367,5.6999998092651367,6.0999999046325684,6.0999999046325684,0,0,0,0,0,0]
[null,2,"Length of barrier (Llb,2), mi:",null,null,null,null,0,2.4049999999999998E-2,2.4049999999999998E-2,null,0,null,0,null,0,null,0,null,0,null,0,null,0,null,0,null,0,null,0,null,0,null,0,null,0,null,0,null,0,null,0,null,0,null,0,null,0,null,0,null,0,null,0,null,0,null,0,null,0,null,0,null,0,null,0,null,0,null,0,null,0,null,0,null,0,null,0,null,0,null,0,null,0,null,0,null,0,0,2.4049999192357063E-2,2.4049999192357063E-2,0,0,0,0,0,0,0,0]
[null,null,"Distance from edge of traveled way to barrier face (Woff,l,2), ft:",null,null,null,null,0,5.7,5.7,null,0,null,0,null,0,null,0,null,0,null,0,null,0,null,0,null,0,null,0,null,0,null,0,null,0,null,0,null,0,null,0,null,0,null,0,null,0,null,0,null,0,null,0,null,0,null,0,null,0,null,0,null,0,null,0,null,0,null,0,null,0,null,0,null,0,null,0,null,0,null,0,null,0,null,0,null,0,0,5.6999998092651367,5.6999998092651367,0,0,0,0,0,0,0,0]
[null,3,"Length of barrier (Llb,3), mi:",null,null,null,null,0,null,0,null,0,null,0,null,0,null,0,null,0,null,0,null,0,null,0,null,0,null,0,null,0,null,0,null,0,null,0,null,0,null,0,null,0,null,0,null,0,null,0,null,0,null,0,null,0,null,0,null,0,null,0,null,0,null,0,null,0,null,0,null,0,null,0,null,0,null,0,null,0,null,0,null,0,null,0,null,0,0,0,0,0,0,0,0,0,0,0,0]
[null,null,"Distance from edge of traveled way to barrier face (Woff,l,3), ft:",null,null,null,null,0,null,0,null,0,null,0,null,0,null,0,null,0,null,0,null,0,null,0,null,0,null,0,null,0,null,0,null,0,null,0,null,0,null,0,null,0,null,0,null,0,null,0,null,0,null,0,null,0,null,0,null,0,null,0,null,0,null,0,null,0,null,0,null,0,null,0,null,0,null,0,null,0,null,0,null,0,null,0,null,0,0,0,0,0,0,0,0,0,0,0,0]
[null,4,"Length of barrier (Llb,4), mi:",null,null,null,null,0,null,0,null,0,null,0,null,0,null,0,null,0,null,0,null,0,null,0,null,0,null,0,null,0,null,0,null,0,null,0,null,0,null,0,null,0,null,0,null,0,null,0,null,0,null,0,null,0,null,0,null,0,null,0,null,0,null,0,null,0,null,0,null,0,null,0,null,0,null,0,null,0,null,0,null,0,null,0,null,0,0,0,0,0,0,0,0,0,0,0,0]
[null,null,"Distance from edge of traveled way to barrier face (Woff,l,4), ft:",null,null,null,null,0,null,0,null,0,null,0,null,0,null,0,null,0,null,0,null,0,null,0,null,0,null,0,null,0,null,0,null,0,null,0,null,0,null,0,null,0,null,0,null,0,null,0,null,0,null,0,null,0,null,0,null,0,null,0,null,0,null,0,null,0,null,0,null,0,null,0,null,0,null,0,null,0,null,0,null,0,null,0,null,0,0,0,0,0,0,0,0,0,0,0,0]
[null,5,"Length of barrier (Llb,5), mi:",null,null,null,null,0,null,0,null,0,null,0,null,0,null,0,null,0,null,0,null,0,null,0,null,0,null,0,null,0,null,0,null,0,null,0,null,0,null,0,null,0,null,0,null,0,null,0,null,0,null,0,null,0,null,0,null,0,null,0,null,0,null,0,null,0,null,0,null,0,null,0,null,0,null,0,null,0,null,0,null,0,null,0,null,0,0,0,0,0,0,0,0,0,0,0,0]
[null,null,"Distance from edge of traveled way to barrier face (Woff,l,5), ft:",null,null,null,null,0,null,0,null,0,null,0,null,0,null,0,null,0,null,0,null,0,null,0,null,0,null,0,null,0,null,0,null,0,null,0,null,0,null,0,null,0,null,0,null,0,null,0,null,0,null,0,null,0,null,0,null,0,null,0,null,0,null,0,null,0,null,0,null,0,null,0,null,0,null,0,null,0,null,0,null,0,null,0,null,0,0,0,0,0,0,0,0,0,0,0,0]
[null,"Ramp Access Data",null,null,"    See note"]
[null,"Ramp","Ramp entrance in segment? (If yes, indicate type.):",null,null,null,"S-C Lane",{"$f":"G71","v":"S-C Lane"},"No","No","S-C Lane",{"$f":"K71","v":"S-C Lane"},"Lane Add",{"$f":"M71","v":"Lane Add"},"No",{"$f":"O71","v":"No"},"No",{"$f":"Q71","v":"No"},null,{"$f":"S71","v":0},null,{"$f":"U71","v":0},null,{"$f":"W71","v":0},null,{"$f":"Y71","v":0},null,{"$f":"AA71","v":0},null,{"$f":"AC71","v":0},null,{"$f":"AE71","v":0},null,{"$f":"AG71","v":0},null,{"$f":"AI71","v":0},null,{"$f":"AK71","v":0},null,{"$f":"AM71","v":0},null,{"$f":"AO71","v":0},null,{"$f":"AQ71","v":0},null,{"$f":"AS71","v":0},null,{"$f":"AU71","v":0},null,{"$f":"AW71","v":0},null,{"$f":"AY71","v":0},null,{"$f":"BA71","v":0},null,{"$f":"BC71","v":0},null,{"$f":"BE71","v":0},null,{"$f":"BG71","v":0},null,{"$f":"BI71","v":0},null,{"$f":"BK71","v":0},null,{"$f":"BM71","v":0},null,{"$f":"BO71","v":0},null,{"$f":"BQ71","v":0},null,{"$f":"BS71","v":0},null,{"$f":"BU71","v":0},null,{"$f":"BW71","v":0},null,{"$f":"BY71","v":0},null,{"$f":"CA71","v":0},null,{"$f":"CC71","v":0},null,{"$f":"CE71","v":0},null,{"$f":"CG71","v":0},null,"S-C Lane","S-C Lane","No","No","S-C Lane","S-C Lane","Lane Add","Lane Add","No","No","No","No"]
[null,"Entrance","Length of entrance s-c lane in segment (Len,seg), mi:",null,null,null,2.367E-2,2.367E-2,null,{"$f":"I72","v":0},4.7350000000000003E-2,4.7350000000000003E-2,null,0,null,0,null,0,null,0,null,0,null,0,null,0,null,0,null,0,null,0,null,0,null,0,null,0,null,0,null,0,null,0,null,0,null,0,null,0,null,0,null,0,null,0,null,0,null,0,null,0,null,0,null,0,null,0,null,0,null,0,null,0,null,0,null,0,null,0,null,0,null,0,null,0,null,2.3669999092817307E-2,2.3669999092817307E-2,0,0,4.7350000590085983E-2,4.7350000590085983E-2,0,0,0,0,0,0]
[null,"Ramp","Ramp exit in segment? (If yes, indicate type.):",null,null,null,"No","No","No","No","S-C Lane","S-C Lane","Lane Drop","Lane Drop","No","No","No","No",null,0,null,0,null,0,null,0,null,0,null,0,null,0,null,0,null,0,null,0,null,0,null,0,null,0,null,0,null,0,null,0,null,0,null,0,null,0,null,0,null,0,null,0,null,0,null,0,null,0,null,0,null,0,null,0,null,0,null,0,null,0,null,0,null,0,null,0,null,"No","No","No","No","S-C Lane","S-C Lane","Lane Drop","Lane Drop","No","No","No","No"]
[null,"Exit","Length of exit s-c lane in segment (Lex,seg), mi:",null,null,null,null,0,null,0,2.8410000000000001E-2,2.8410000000000001E-2,null,0,null,0,null,0,null,0,null,0,null,0,null,0,null,0,null,0,null,0,null,0,null,0,null,0,null,0,null,0,null,0,null,0,null,0,null,0,null,0,null,0,null,0,null,0,null,0,null,0,null,0,null,0,null,0,null,0,null,0,null,0,null,0,null,0,null,0,null,0,null,0,null,0,null,0,0,0,0,2.841000072658062E-2,2.841000072658062E-2,0,0,0,0,0,0]
[null,"Weaving","Weave section in collector-distributor road segment?:",null,null,null,null,0,null,0,null,0,"Yes","Yes",null,0,null,0,null,0,null,0,null,0,null,0,null,0,null,0,null,0,null,0,null,0,null,0,null,0,null,0,null,0,null,0,null,0,null,0,null,0,null,0,null,0,null,0,null,0,null,0,null,0,null,0,null,0,null,0,null,0,null,0,null,0,null,0,null,0,null,0,null,0,null,0,null,null,null,null,null,null,null,"Yes","Yes"]
[null,"Section","Length of weaving section (Lwev), mi:",null,null,null,null,0,null,0,null,0,0.25,0.25,null,0,null,0,null,0,null,0,null,0,null,0,null,0,null,0,null,0,null,0,null,0,null,0,null,0,null,0,null,0,null,0,null,0,null,0,null,0,null,0,null,0,null,0,null,0,null,0,null,0,null,0,null,0,null,0,null,0,null,0,null,0,null,0,null,0,null,0,null,0,null,0,null,0,0,0,0,0,0,0.25,0.25,0,0,0,0]
[null,null,"Length of weaving section in segment (Lwev,seg), mi:",null,null,null,null,0,null,0,null,0,0.15,0.15,null,0,null,0,null,0,null,0,null,0,null,0,null,0,null,0,null,0,null,0,null,0,null,0,null,0,null,0,null,0,null,0,null,0,null,0,null,0,null,0,null,0,null,0,null,0,null,0,null,0,null,0,null,0,null,0,null,0,null,0,null,0,null,0,null,0,null,0,null,0,null,0,null,0,0,0,0,0,0,0.15000000596046448,0.15000000596046448,0,0,0,0]
[null,"Traffic Data",null,null,null,"Year"]
[null,"Average daily traffic (AADTr or AADTc) by year, veh/d:",null,null,null,{"$f":"Main!AG5","v":2005},2800,null,null,null,null,null,null,null,null,null,null,null,null,null,null,null,null,null,null,null,null,null,null,null,null,null,null,null,null,null,null,null,null,null,null,null,null,null,null,null,null,null,null,null,null,null,null,null,null,null,null,null,null,null,null,null,null,null,null,null,null,null,null,null,null,null,null,null,null,null,null,null,null,null,null,null,null,null,null,null,null,2800,null,0,null,0,null,0,null,0,null,0]
[null," (enter data only for those years for which",null,null,null,{"$f":"F79+1","v":2006},null,null,2900,null,3600,null,4500,null,5000,null,5000,null,null,null,null,null,null,null,null,null,null,null,null,null,null,null,null,null,null,null,null,null,null,null,null,null,null,null,null,null,null,null,null,null,null,null,null,null,null,null,null,null,null,null,null,null,null,null,null,null,null,null,null,null,null,null,null,null,null,null,null,null,null,null,null,null,null,null,null,null,null,0,null,2900,null,3600,null,4500,null,5000,null,5000]
[null,"  it is available, leave other years blank)",null,null,null,{"$f":"F80+1","v":2007},3000,null,null,null,null,null,null,null,null,null,null,null,null,null,null,null,null,null,null,null,null,null,null,null,null,null,null,null,null,null,null,null,null,null,null,null,null,null,null,null,null,null,null,null,null,null,null,null,null,null,null,null,null,null,null,null,null,null,null,null,null,null,null,null,null,null,null,null,null,null,null,null,null,null,null,null,null,null,null,null,null,3000,null,0,null,0,null,0,null,0,null,0]
[null,null,null,null,null,2008,null,null,null,null,null,null,null,null,null,null,null,null,null,null,null,null,null,null,null,null,null,null,null,null,null,null,null,null,null,null,null,null,null,null,null,null,null,null,null,null,null,null,null,null,null,null,null,null,null,null,null,null,null,null,null,null,null,null,null,null,null,null,null,null,null,null,null,null,null,null,null,null,null,null,null,null,null,null,null,null,null,0,null,0,null,0,null,0,null,0,null,0]
[null,null,null,null,null,2009,null,null,null,null,null,null,null,null,null,null,null,null,null,null,null,null,null,null,null,null,null,null,null,null,null,null,null,null,null,null,null,null,null,null,null,null,null,null,null,null,null,null,null,null,null,null,null,null,null,null,null,null,null,null,null,null,null,null,null,null,null,null,null,null,null,null,null,null,null,null,null,null,null,null,null,null,null,null,null,null,null,0,null,0,null,0,null,0,null,0,null,0]
[null,null,null,null,null,2010,null,null,null,null,null,null,null,null,null,null,null,null,null,null,null,null,null,null,null,null,null,null,null,null,null,null,null,null,null,null,null,null,null,null,null,null,null,null,null,null,null,null,null,null,null,null,null,null,null,null,null,null,null,null,null,null,null,null,null,null,null,null,null,null,null,null,null,null,null,null,null,null,null,null,null,null,null,null,null,null,null,0,null,0,null,0,null,0,null,0,null,0]
[null,null,null,null,null,2011,null,null,null,null,null,null,null,null,null,null,null,null,null,null,null,null,null,null,null,null,null,null,null,null,null,null,null,null,null,null,null,null,null,null,null,null,null,null,null,null,null,null,null,null,null,null,null,null,null,null,null,null,null,null,null,null,null,null,null,null,null,null,null,null,null,null,null,null,null,null,null,null,null,null,null,null,null,null,null,null,null,0,null,0,null,0,null,0,null,0,null,0]
[null,null,null,null,null,2012,null,null,null,null,null,null,null,null,null,null,null,null,null,null,null,null,null,null,null,null,null,null,null,null,null,null,null,null,null,null,null,null,null,null,null,null,null,null,null,null,null,null,null,null,null,null,null,null,null,null,null,null,null,null,null,null,null,null,null,null,null,null,null,null,null,null,null,null,null,null,null,null,null,null,null,null,null,null,null,null,null,0,null,0,null,0,null,0,null,0,null,0]
[null,null,null,null,null,2013,null,null,null,null,null,null,null,null,null,null,null,null,null,null,null,null,null,null,null,null,null,null,null,null,null,null,null,null,null,null,null,null,null,null,null,null,null,null,null,null,null,null,null,null,null,null,null,null,null,null,null,null,null,null,null,null,null,null,null,null,null,null,null,null,null,null,null,null,null,null,null,null,null,null,null,null,null,null,null,null,null,0,null,0,null,0,null,0,null,0,null,0]
[null,null,null,null,null,2014,3400,null,null,null,4600,null,null,null,null,null,null,null,null,null,null,null,null,null,null,null,null,null,null,null,null,null,null,null,null,null,null,null,null,null,null,null,null,null,null,null,null,null,null,null,null,null,null,null,null,null,null,null,null,null,null,null,null,null,null,null,null,null,null,null,null,null,null,null,null,null,null,null,null,null,null,null,null,null,null,null,null,0,null,0,null,0,null,0,null,0,null,0]
[null,null,null,null,null,2015,null,null,null,null,null,null,null,null,null,null,null,null,null,null,null,null,null,null,null,null,null,null,null,null,null,null,null,null,null,null,null,null,null,null,null,null,null,null,null,null,null,null,null,null,null,null,null,null,null,null,null,null,null,null,null,null,null,null,null,null,null,null,null,null,null,null,null,null,null,null,null,null,null,null,null,null,null,null,null,null,null,0,null,0,null,0,null,0,null,0,null,0]
[null,null,null,null,null,2016,null,null,null,null,null,null,null,null,null,null,null,null,null,null,null,null,null,null,null,null,null,null,null,null,null,null,null,null,null,null,null,null,null,null,null,null,null,null,null,null,null,null,null,null,null,null,null,null,null,null,null,null,null,null,null,null,null,null,null,null,null,null,null,null,null,null,null,null,null,null,null,null,null,null,null,null,null,null,null,null,null,0,null,0,null,0,null,0,null,0,null,0]
[null,null,null,null,null,2017,null,null,null,null,null,null,null,null,null,null,null,null,null,null,null,null,null,null,null,null,null,null,null,null,null,null,null,null,null,null,null,null,null,null,null,null,null,null,null,null,null,null,null,null,null,null,null,null,null,null,null,null,null,null,null,null,null,null,null,null,null,null,null,null,null,null,null,null,null,null,null,null,null,null,null,null,null,null,null,null,null,0,null,0,null,0,null,0,null,0,null,0]
[null,null,null,null,null,2018,null,null,null,null,null,null,null,null,null,null,null,null,null,null,null,null,null,null,null,null,null,null,null,null,null,null,null,null,null,null,null,null,null,null,null,null,null,null,null,null,null,null,null,null,null,null,null,null,null,null,null,null,null,null,null,null,null,null,null,null,null,null,null,null,null,null,null,null,null,null,null,null,null,null,null,null,null,null,null,null,null,0,null,0,null,0,null,0,null,0,null,0]
[null,null,null,null,null,2019,null,null,null,null,null,null,null,null,null,null,null,null,null,null,null,null,null,null,null,null,null,null,null,null,null,null,null,null,null,null,null,null,null,null,null,null,null,null,null,null,null,null,null,null,null,null,null,null,null,null,null,null,null,null,null,null,null,null,null,null,null,null,null,null,null,null,null,null,null,null,null,null,null,null,null,null,null,null,null,null,null,0,null,0,null,0,null,0,null,0,null,0]
[null,null,null,null,null,2020,null,null,null,null,null,null,null,null,null,null,null,null,null,null,null,null,null,null,null,null,null,null,null,null,null,null,null,null,null,null,null,null,null,null,null,null,null,null,null,null,null,null,null,null,null,null,null,null,null,null,null,null,null,null,null,null,null,null,null,null,null,null,null,null,null,null,null,null,null,null,null,null,null,null,null,null,null,null,null,null,null,0,null,0,null,0,null,0,null,0,null,0]
[null,null,null,null,null,2021,null,null,null,null,null,null,null,null,null,null,null,null,null,null,null,null,null,null,null,null,null,null,null,null,null,null,null,null,null,null,null,null,null,null,null,null,null,null,null,null,null,null,null,null,null,null,null,null,null,null,null,null,null,null,null,null,null,null,null,null,null,null,null,null,null,null,null,null,null,null,null,null,null,null,null,null,null,null,null,null,null,0,null,0,null,0,null,0,null,0,null,0]
[null,null,null,null,null,2022,null,null,null,null,null,null,null,null,null,null,null,null,null,null,null,null,null,null,null,null,null,null,null,null,null,null,null,null,null,null,null,null,null,null,null,null,null,null,null,null,null,null,null,null,null,null,null,null,null,null,null,null,null,null,null,null,null,null,null,null,null,null,null,null,null,null,null,null,null,null,null,null,null,null,null,null,null,null,null,null,null,0,null,0,null,0,null,0,null,0,null,0]
[null,null,null,null,null,2023,null,null,null,null,null,null,null,null,null,null,null,null,null,null,null,null,null,null,null,null,null,null,null,null,null,null,null,null,null,null,null,null,null,null,null,null,null,null,null,null,null,null,null,null,null,null,null,null,null,null,null,null,null,null,null,null,null,null,null,null,null,null,null,null,null,null,null,null,null,null,null,null,null,null,null,null,null,null,null,null,null,0,null,0,null,0,null,0,null,0,null,0]
[null,null,null,null,null,2024,null,null,null,null,null,null,null,null,null,null,null,null,null,null,null,null,null,null,null,null,null,null,null,null,null,null,null,null,null,null,null,null,null,null,null,null,null,null,null,null,null,null,null,null,null,null,null,null,null,null,null,null,null,null,null,null,null,null,null,null,null,null,null,null,null,null,null,null,null,null,null,null,null,null,null,null,null,null,null,null,null,0,null,0,null,0,null,0,null,0,null,0]
[null,null,null,null,null,2025,null,null,null,null,null,null,null,null,null,null,null,null,null,null,null,null,null,null,null,null,null,null,null,null,null,null,null,null,null,null,null,null,null,null,null,null,null,null,null,null,null,null,null,null,null,null,null,null,null,null,null,null,null,null,null,null,null,null,null,null,null,null,null,null,null,null,null,null,null,null,null,null,null,null,null,null,null,null,null,null,null,0,null,0,null,0,null,0,null,0,null,0]
[null,null,null,null,null,2026,null,null,null,null,null,null,null,null,null,null,null,null,null,null,null,null,null,null,null,null,null,null,null,null,null,null,null,null,null,null,null,null,null,null,null,null,null,null,null,null,null,null,null,null,null,null,null,null,null,null,null,null,null,null,null,null,null,null,null,null,null,null,null,null,null,null,null,null,null,null,null,null,null,null,null,null,null,null,null,null,null,0,null,0,null,0,null,0,null,0,null,0]
[null,null,null,null,null,2027,null,null,null,null,null,null,null,null,null,null,null,null,null,null,null,null,null,null,null,null,null,null,null,null,null,null,null,null,null,null,null,null,null,null,null,null,null,null,null,null,null,null,null,null,null,null,null,null,null,null,null,null,null,null,null,null,null,null,null,null,null,null,null,null,null,null,null,null,null,null,null,null,null,null,null,null,null,null,null,null,null,0,null,0,null,0,null,0,null,0,null,0]
[null,null,null,null,null,2028,null,null,null,null,null,null,null,null,null,null,null,null,null,null,null,null,null,null,null,null,null,null,null,null,null,null,null,null,null,null,null,null,null,null,null,null,null,null,null,null,null,null,null,null,null,null,null,null,null,null,null,null,null,null,null,null,null,null,null,null,null,null,null,null,null,null,null,null,null,null,null,null,null,null,null,null,null,null,null,null,null,0,null,0,null,0,null,0,null,0,null,0]
[null,"Crash Data",null,null,"Year",{"$f":"IF(Main!$AG$15=TRUE, \"Project Crashes\", \"\")","v":""},"Segment Crashes -->"]
[null,"Count of Fatal-and-Injury (FI) Crashes by Year"]
[null,null,"Multiple-vehicle crashes",null,{"$f":"Main!AG7","v":2005},0,0]
[null,null,"(No,w,n,mv,fi)",null,{"$f":"E105+1","v":2006},2,0,null,0,null,0,null,0,null,0,null,0]
[null,null,null,null,{"$f":"E106+1","v":2007},0,0]
[null,null,null,null,{"$f":"E107+1","v":2008}]
[null,null,null,null,{"$f":"E108+1","v":2009}]
[null,null,"Single-vehicle crashes",null,{"$f":"E105","v":2005},null,0,null,null,null,1,null,1]
[null,null,"(No,w,n,sv,fi)",null,{"$f":"E106","v":2006},null,0,null,0,null,0,null,0,null,0,null,0]
[null,null,null,null,{"$f":"E107","v":2007},null,0]
[null,null,null,null,{"$f":"E108","v":2008}]
[null,null,null,null,{"$f":"E109","v":2009}]
[null,"Count of Property-Damage-Only (PDO) Crashes by Year"]
[null,null,"Multiple-vehicle crashes",null,{"$f":"E110","v":2005},2,0]
[null,null,"(No,w,n,mv,pdo)",null,{"$f":"E111","v":2006},0,0,null,0,null,0,null,1,null,0,null,0]
[null,null,null,null,{"$f":"E112","v":2007},2,0]
[null,null,null,null,{"$f":"E113","v":2008}]
[null,null,null,null,{"$f":"E114","v":2009}]
[null,null,"Single-vehicle crashes",null,{"$f":"E116","v":2005},null,0,null,null,null,1]
[null,null,"(No,w,n,sv,pdo)",null,{"$f":"E117","v":2006},null,0,null,0,null,1,null,1,null,0,null,0]
[null,null,null,null,{"$f":"E118","v":2007},null,0]
[null,null,null,null,{"$f":"E119","v":2008}]
[null,null,null,null,{"$f":"E120","v":2009}]
[]
[null,"Advisory Messages"]
[]
[]
[]
[]
[]
[]
[]
[]
[]
[]
[]
[]
[]
[]
[]
[]
[]
[]
[]
[]
[]
[]
[]
[]
[]
[]
[]
[]
[]
[]
[]
[]
[]
[]
[]
[]
[]
[]
[]
[]
[]
[]
[]
[]
[null,"Variable Limits"]
[null,{"$f":"B8","v":"Number of through lanes (n):"},null,null,null,null,{"$f":"IF(Main!$K$6=\"Urban\", 2,1)","v":2},{"$f":"IF(Main!$K$6=\"Urban\", 2,1)","v":2},{"$f":"IF(Main!$K$6=\"Urban\", 2,1)","v":2},{"$f":"IF(Main!$K$6=\"Urban\", 2,1)","v":2},{"$f":"IF(Main!$K$6=\"Urban\", 2,1)","v":2},{"$f":"IF(Main!$K$6=\"Urban\", 2,1)","v":2},{"$f":"IF(Main!$K$6=\"Urban\", 2,1)","v":2},{"$f":"IF(Main!$K$6=\"Urban\", 2,1)","v":2},{"$f":"IF(Main!$K$6=\"Urban\", 2,1)","v":2},{"$f":"IF(Main!$K$6=\"Urban\", 2,1)","v":2},{"$f":"IF(Main!$K$6=\"Urban\", 2,1)","v":2},{"$f":"IF(Main!$K$6=\"Urban\", 2,1)","v":2},{"$f":"IF(Main!$K$6=\"Urban\", 2,1)","v":2},{"$f":"IF(Main!$K$6=\"Urban\", 2,1)","v":2},{"$f":"IF(Main!$K$6=\"Urban\", 2,1)","v":2},{"$f":"IF(Main!$K$6=\"Urban\", 2,1)","v":2},{"$f":"IF(Main!$K$6=\"Urban\", 2,1)","v":2},{"$f":"IF(Main!$K$6=\"Urban\", 2,1)","v":2},{"$f":"IF(Main!$K$6=\"Urban\", 2,1)","v":2},{"$f":"IF(Main!$K$6=\"Urban\", 2,1)","v":2},{"$f":"IF(Main!$K$6=\"Urban\", 2,1)","v":2},{"$f":"IF(Main!$K$6=\"Urban\", 2,1)","v":2},{"$f":"IF(Main!$K$6=\"Urban\", 2,1)","v":2},{"$f":"IF(Main!$K$6=\"Urban\", 2,1)","v":2},{"$f":"IF(Main!$K$6=\"Urban\", 2,1)","v":2},{"$f":"IF(Main!$K$6=\"Urban\", 2,1)","v":2},{"$f":"IF(Main!$K$6=\"Urban\", 2,1)","v":2},{"$f":"IF(Main!$K$6=\"Urban\", 2,1)","v":2},{"$f":"IF(Main!$K$6=\"Urban\", 2,1)","v":2},{"$f":"IF(Main!$K$6=\"Urban\", 2,1)","v":2},{"$f":"IF(Main!$K$6=\"Urban\", 2,1)","v":2},{"$f":"IF(Main!$K$6=\"Urban\", 2,1)","v":2},{"$f":"IF(Main!$K$6=\"Urban\", 2,1)","v":2},{"$f":"IF(Main!$K$6=\"Urban\", 2,1)","v":2},{"$f":"IF(Main!$K$6=\"Urban\", 2,1)","v":2},{"$f":"IF(Main!$K$6=\"Urban\", 2,1)","v":2},{"$f":"IF(Main!$K$6=\"Urban\", 2,1)","v":2},{"$f":"IF(Main!$K$6=\"Urban\", 2,1)","v":2},{"$f":"IF(Main!$K$6=\"Urban\", 2,1)","v":2},{"$f":"IF(Main!$K$6=\"Urban\", 2,1)","v":2},{"$f":"IF(Main!$K$6=\"Urban\", 2,1)","v":2},{"$f":"IF(Main!$K$6=\"Urban\", 2,1)","v":2},{"$f":"IF(Main!$K$6=\"Urban\", 2,1)","v":2},{"$f":"IF(Main!$K$6=\"Urban\", 2,1)","v":2},{"$f":"IF(Main!$K$6=\"Urban\", 2,1)","v":2},{"$f":"IF(Main!$K$6=\"Urban\", 2,1)","v":2},{"$f":"IF(Main!$K$6=\"Urban\", 2,1)","v":2},{"$f":"IF(Main!$K$6=\"Urban\", 2,1)","v":2},{"$f":"IF(Main!$K$6=\"Urban\", 2,1)","v":2},{"$f":"IF(Main!$K$6=\"Urban\", 2,1)","v":2},{"$f":"IF(Main!$K$6=\"Urban\", 2,1)","v":2},{"$f":"IF(Main!$K$6=\"Urban\", 2,1)","v":2},{"$f":"IF(Main!$K$6=\"Urban\", 2,1)","v":2},{"$f":"IF(Main!$K$6=\"Urban\", 2,1)","v":2},{"$f":"IF(Main!$K$6=\"Urban\", 2,1)","v":2},{"$f":"IF(Main!$K$6=\"Urban\", 2,1)","v":2},{"$f":"IF(Main!$K$6=\"Urban\", 2,1)","v":2},{"$f":"IF(Main!$K$6=\"Urban\", 2,1)","v":2},{"$f":"IF(Main!$K$6=\"Urban\", 2,1)","v":2},{"$f":"IF(Main!$K$6=\"Urban\", 2,1)","v":2},{"$f":"IF(Main!$K$6=\"Urban\", 2,1)","v":2},{"$f":"IF(Main!$K$6=\"Urban\", 2,1)","v":2},{"$f":"IF(Main!$K$6=\"Urban\", 2,1)","v":2},{"$f":"IF(Main!$K$6=\"Urban\", 2,1)","v":2},{"$f":"IF(Main!$K$6=\"Urban\", 2,1)","v":2},{"$f":"IF(Main!$K$6=\"Urban\", 2,1)","v":2},{"$f":"IF(Main!$K$6=\"Urban\", 2,1)","v":2},{"$f":"IF(Main!$K$6=\"Urban\", 2,1)","v":2},{"$f":"IF(Main!$K$6=\"Urban\", 2,1)","v":2},{"$f":"IF(Main!$K$6=\"Urban\", 2,1)","v":2},{"$f":"IF(Main!$K$6=\"Urban\", 2,1)","v":2},{"$f":"IF(Main!$K$6=\"Urban\", 2,1)","v":2},{"$f":"IF(Main!$K$6=\"Urban\", 2,1)","v":2},{"$f":"IF(Main!$K$6=\"Urban\", 2,1)","v":2},{"$f":"IF(Main!$K$6=\"Urban\", 2,1)","v":2},{"$f":"IF(Main!$K$6=\"Urban\", 2,1)","v":2},{"$f":"IF(Main!$K$6=\"Urban\", 2,1)","v":2},{"$f":"IF(Main!$K$6=\"Urban\", 2,1)","v":2},{"$f":"IF(Main!$K$6=\"Urban\", 2,1)","v":2},{"$f":"IF(Main!$K$6=\"Urban\", 2,1)","v":2}]
[null,{"$f":"C19","v":"Length of curve in segment (Lc1,seg), mi:"},null,null,null,null,{"$f":"MIN(G$10,G18)","v":0.101136},{"$f":"MIN(H$10,H18)","v":0.101136},0.06,0.06,4.6780000000000002E-2,4.6780000000000002E-2,0.18,0,9.9169999999999994E-2,9.9169999999999994E-2,4.9599999999999998E-2,4.9599999999999998E-2,0,0,0,0,0,0,0,0,0,0,0,0,0,0,0,0,0,0,0,0,0,0,0,0,0,0,0,0,0,0,0,0,0,0,0,0,0,0,0,0,0,0,0,0,0,0,0,0,0,0,0,0,0,{"$f":"MIN(BT$10,BT18)","v":0},0,0,0,0,0,0,0,0,0,0,0,0,0,0]
[null,{"$f":"C24","v":"Length of curve in segment (Lc2,seg), mi:"},null,null,null,null,{"$f":"MIN(G$10,G23)","v":0.23},{"$f":"MIN(H$10,H23)","v":0},0.06,0.06,9.1859999999999997E-2,9.1859999999999997E-2,0.18,0,4.9599999999999998E-2,4.9599999999999998E-2,9.9169999999999994E-2,9.9169999999999994E-2,0,0,0,0,0,0,0,0,0,0,0,0,0,0,0,0,0,0,0,0,0,0,0,0,0,0,0,0,0,0,0,0,0,0,0,0,0,0,0,0,0,0,0,0,0,0,0,0,0,0,0,0,0,{"$f":"MIN(BT$10,BT23)","v":0},0,0,0,0,0,0,0,0,0,0,0,0,0,0]
[null,{"$f":"C29","v":"Length of curve in segment (Lc3,seg), mi:"},null,null,null,null,{"$f":"MIN(G$10,G28)","v":0.23},{"$f":"MIN(H$10,H28)","v":0},0.06,0,0.2,0,0.18,0,0.1,0,0.2,0,0,0,0,0,0,0,0,0,0,0,0,0,0,0,0,0,0,0,0,0,0,0,0,0,0,0,0,0,0,0,0,0,0,0,0,0,0,0,0,0,0,0,0,0,0,0,0,0,0,0,0,0,0,{"$f":"MIN(BT$10,BT28)","v":0},0,0,0,0,0,0,0,0,0,0,0,0,0,0]
[null,{"$f":"C34","v":"Length of curve in segment (Lc4,seg), mi:"},null,null,null,null,{"$f":"MIN(G$10,G33)","v":0.23},{"$f":"MIN(H$10,H33)","v":0},0.06,0,0.2,0,0.18,0,0.1,0,0.2,0,0,0,0,0,0,0,0,0,0,0,0,0,0,0,0,0,0,0,0,0,0,0,0,0,0,0,0,0,0,0,0,0,0,0,0,0,0,0,0,0,0,0,0,0,0,0,0,0,0,0,0,0,0,{"$f":"MIN(BT$10,BT33)","v":0},0,0,0,0,0,0,0,0,0,0,0,0,0,0]
[null,{"$f":"C39","v":"Length of curve in segment (Lc5,seg), mi:"},null,null,null,null,{"$f":"MIN(G$10,G38)","v":0.23},{"$f":"MIN(H$10,H38)","v":0},0.06,0,0.2,0,0.18,0,0.1,0,0.2,0,0,0,0,0,0,0,0,0,0,0,0,0,0,0,0,0,0,0,0,0,0,0,0,0,0,0,0,0,0,0,0,0,0,0,0,0,0,0,0,0,0,0,0,0,0,0,0,0,0,0,0,0,0,{"$f":"MIN(BT$10,BT38)","v":0},0,0,0,0,0,0,0,0,0,0,0,0,0,0]
[null,{"$f":"C46","v":"Length of taper in segment (Ladd,seg or Ldrop,seg), mi:"},null,null,null,null,{"$f":"MIN(G$10,0.3)","v":0.23},0.23,0.06,0.06,0.2,0.2,0.18,0.18,0.1,0.1,0.2,0.2,0.3,0,0.3,0,0.3,0,0.3,0,0.3,0,0.3,0,0.3,0,0.3,0,0.3,0,0.3,0,{"$f":"MIN(AM$10,0.3)","v":0.3},0,0.3,0,0.3,0,0.3,0,0.3,0,0.3,0,0.3,0,0.3,0,0.3,0,0.3,0,0.3,0,0.3,0,0.3,0,0.3,0,0.3,0,0.3,0,{"$f":"MIN(BS$10,0.3)","v":0.3},0,0.3,0,0.3,0,0.3,0,0.3,0,0.3,0,0.3,0,0.3,0]
[null,{"$f":"C72","v":"Length of entrance s-c lane in segment (Len,seg), mi:"},null,null,null,null,{"$f":"MIN(G$10,0.19)","v":0.19},{"$f":"MIN(H$10,0.19)","v":0.19},0.06,0.06,0.19,0.19,0.18,0.18,0.1,0.1,0.19,0.19,0.19,0,0.19,0,0.19,0,0.19,0,0.19,0,0.19,0,0.19,0,0.19,0,0.19,0,0.19,0,0.19,0,0.19,0,0.19,0,0.19,0,0.19,0,0.19,0,0.19,0,0.19,0,0.19,0,0.19,0,0.19,0,0.19,0,0.19,0,0.19,0,0.19,0,0.19,0,0.19,{"$f":"MIN(BT$10,0.19)","v":0},0.19,0,0.19,0,0.19,0,0.19,0,0.19,0,0.19,0,0.19,0]
[null,{"$f":"C74","v":"Length of exit s-c lane in segment (Lex,seg), mi:"},null,null,null,null,{"$f":"MIN(G$10,0.19)","v":0.19},{"$f":"MIN(H$10,0.19)","v":0.19},0.06,0.06,0.19,0.19,0.18,0.18,0.1,0.1,0.19,0.19,0.19,0,0.19,0,0.19,0,0.19,0,0.19,0,0.19,0,0.19,0,0.19,0,0.19,0,0.19,0,0.19,0,0.19,0,0.19,0,0.19,0,0.19,0,0.19,0,0.19,0,0.19,0,0.19,0,0.19,0,0.19,0,0.19,0,0.19,0,0.19,0,0.19,0,0.19,0,0.19,{"$f":"MIN(BT$10,0.19)","v":0},0.19,0,0.19,0,0.19,0,0.19,0,0.19,0,0.19,0,0.19,0]
[null,{"$f":"C77","v":"Length of weaving section in segment (Lwev,seg), mi:"},null,null,null,null,{"$f":"MIN(G$10,G76,0.3)","v":0.23},{"$f":"MIN(H$10,H76,0.3)","v":0},0.06,0,0.2,0,0.18,0.18,0.1,0,0.2,0,0.3,0,0.3,0,0.3,0,0.3,0,0.3,0,0.3,0,0.3,0,0.3,0,0.3,0,0.3,0,0.3,0,0.3,0,0.3,0,0.3,0,0.3,0,0.3,0,0.3,0,0.3,0,0.3,0,0.3,0,0.3,0,0.3,0,0.3,0,0.3,0,0.3,0,0.3,0,0.3,{"$f":"MIN(BT$10,BT76,0.3)","v":0},0.3,0,0.3,0,0.3,0,0.3,0,0.3,0,0.3,0,0.3,0]

{"sheet":"Input Ramp Terminals","index":5,"n_rows":183,"n_cols":31,"rows_kept":183,"cut":false,"hidden":false,"merged":[[4,26,5,26],[4,27,5,27],[4,28,5,28],[4,29,5,29],[4,30,5,30],[4,20,5,20],[4,21,5,21],[4,22,5,22],[4,23,5,23],[4,24,5,24],[4,25,5,25],[4,17,5,17],[4,10,5,10],[4,11,5,11],[4,12,5,12],[4,13,5,13],[4,19,5,19],[4,15,5,15],[4,16,5,16],[4,6,5,6],[4,7,5,7],[4,8,5,8],[4,9,5,9],[46,6,46,7],[47,6,47,7],[48,6,48,7],[49,6,49,7],[140,5,141,5],[4,14,5,14],[44,6,44,7],[45,6,45,7],[54,6,54,7],[55,6,55,7],[56,6,56,7],[57,6,57,7],[50,6,50,7],[51,6,51,7],[52,6,52,7],[53,6,53,7],[62,6,62,7],[63,6,63,7],[64,6,64,7],[65,6,65,7],[58,6,58,7],[59,6,59,7],[60,6,60,7],[61,6,61,7],[66,6,66,7],[67,6,67,7],[44,8,44,9],[45,8,45,9],[46,8,46,9],[47,8,47,9],[48,8,48,9],[49,8,49,9],[50,8,50,9],[51,8,51,9],[56,8,56,9],[57,8,57,9],[58,8,58,9],[59,8,59,9],[52,8,52,9],[53,8,53,9],[54,8,54,9],[55,8,55,9],[64,8,64,9],[65,8,65,9],[66,8,66,9],[67,8,67,9],[60,8,60,9],[61,8,61,9],[62,8,62,9],[63,8,63,9],[48,10,48,11],[49,10,49,11],[50,10,50,11],[51,10,51,11],[44,10,44,11],[45,10,45,11],[46,10,46,11],[47,10,47,11],[56,10,56,11],[57,10,57,11],[58,10,58,11],[59,10,59,11],[52,10,52,11],[53,10,53,11],[54,10,54,11],[55,10,55,11],[64,10,64,11],[65,10,65,11],[66,10,66,11],[67,10,67,11],[60,10,60,11],[61,10,61,11],[62,10,62,11],[63,10,63,11],[48,12,48,13],[49,12,49,13],[50,12,50,13],[51,12,51,13],[64,12,64,13],[65,12,65,13],[66,12,66,13],[67,12,67,13],[60,12,60,13],[61,12,61,13],[62,12,62,13],[63,12,63,13],[44,12,44,13],[45,12,45,13],[46,12,46,13],[47,12,47,13],[56,12,56,13],[57,12,57,13],[58,12,58,13],[59,12,59,13],[52,12,52,13],[53,12,53,13],[54,12,54,13],[55,12,55,13],[55,14,55,15],[64,14,64,15],[65,14,65,15],[48,14,48,15],[49,14,49,15],[50,14,50,15],[51,14,51,15],[44,14,44,15],[45,14,45,15],[46,14,46,15],[47,14,47,15],[56,14,56,15],[66,14,66,15],[67,14,67,15],[60,14,60,15],[61,14,61,15],[62,14,62,15],[63,14,63,15],[48,16,48,17],[49,16,49,17],[50,16,50,17],[51,16,51,17],[64,16,64,17],[65,16,65,17],[66,16,66,17],[67,16,67,17],[60,16,60,17],[61,16,61,17],[62,16,62,17],[63,16,63,17],[57,14,57,15],[58,14,58,15],[59,14,59,15],[52,14,52,15],[53,14,53,15],[54,14,54,15],[44,16,44,17],[45,16,45,17],[46,16,46,17],[47,16,47,17],[56,16,56,17],[57,16,57,17],[58,16,58,17],[59,16,59,17],[52,16,52,17],[53,16,53,17],[54,16,54,17],[55,16,55,17],[79,6,79,7],[88,6,88,7],[89,6,89,7],[72,6,72,7],[73,6,73,7],[74,6,74,7],[75,6,75,7],[68,6,68,7],[69,6,69,7],[70,6,70,7],[71,6,71,7],[80,6,80,7],[90,6,90,7],[91,6,91,7],[84,6,84,7],[85,6,85,7],[86,6,86,7],[87,6,87,7],[72,8,72,9],[73,8,73,9],[74,8,74,9],[75,8,75,9],[88,8,88,9],[89,8,89,9],[90,8,90,9],[91,8,91,9],[84,8,84,9],[85,8,85,9],[86,8,86,9],[87,8,87,9],[81,6,81,7],[82,6,82,7],[83,6,83,7],[76,6,76,7],[77,6,77,7],[78,6,78,7],[68,8,68,9],[69,8,69,9],[70,8,70,9],[71,8,71,9],[80,8,80,9],[81,8,81,9],[82,8,82,9],[83,8,83,9],[76,8,76,9],[77,8,77,9],[78,8,78,9],[79,8,79,9],[79,10,79,11],[88,10,88,11],[89,10,89,11],[72,10,72,11],[73,10,73,11],[74,10,74,11],[75,10,75,11],[68,10,68,11],[69,10,69,11],[70,10,70,11],[71,10,71,11],[80,10,80,11],[90,10,90,11],[91,10,91,11],[84,10,84,11],[85,10,85,11],[86,10,86,11],[87,10,87,11],[72,12,72,13],[73,12,73,13],[74,12,74,13],[75,12,75,13],[88,12,88,13],[89,12,89,13],[90,12,90,13],[91,12,91,13],[84,12,84,13],[85,12,85,13],[86,12,86,13],[87,12,87,13],[81,10,81,11],[82,10,82,11],[83,10,83,11],[76,10,76,11],[77,10,77,11],[78,10,78,11],[68,12,68,13],[69,12,69,13],[70,12,70,13],[71,12,71,13],[80,12,80,13],[81,12,81,13],[82,12,82,13],[83,12,83,13],[76,12,76,13],[77,12,77,13],[78,12,78,13],[79,12,79,13],[79,14,79,15],[88,14,88,15],[89,14,89,15],[72,14,72,15],[73,14,73,15],[74,14,74,15],[75,14,75,15],[68,14,68,15],[69,14,69,15],[70,14,70,15],[71,14,71,15],[80,14,80,15],[90,14,90,15],[91,14,91,15],[84,14,84,15],[85,14,85,15],[86,14,86,15],[87,14,87,15],[72,16,72,17],[73,16,73,17],[74,16,74,17],[75,16,75,17],[88,16,88,17],[89,16,89,17],[90,16,90,17],[91,16,91,17],[84,16,84,17],[85,16,85,17],[86,16,86,17],[87,16,87,17],[81,14,81,15],[82,14,82,15],[83,14,83,15],[76,14,76,15],[77,14,77,15],[78,14,78,15],[68,16,68,17],[69,16,69,17],[70,16,70,17],[71,16,71,17],[80,16,80,17],[81,16,81,17],[82,16,82,17],[83,16,83,17],[76,16,76,17],[77,16,77,17],[78,16,78,17],[79,16,79,17],[103,6,103,7],[112,6,112,7],[113,6,113,7],[96,6,96,7],[97,6,97,7],[98,6,98,7],[99,6,99,7],[92,6,92,7],[93,6,93,7],[94,6,94,7],[95,6,95,7],[104,6,104,7],[114,6,114,7],[115,6,115,7],[108,6,108,7],[109,6,109,7],[110,6,110,7],[111,6,111,7],[96,8,96,9],[97,8,97,9],[98,8,98,9],[99,8,99,9],[112,8,112,9],[113,8,113,9],[114,8,114,9],[115,8,115,9],[108,8,108,9],[109,8,109,9],[110,8,110,9],[111,8,111,9],[105,6,105,7],[106,6,106,7],[107,6,107,7],[100,6,100,7],[101,6,101,7],[102,6,102,7],[92,8,92,9],[93,8,93,9],[94,8,94,9],[95,8,95,9],[104,8,104,9],[105,8,105,9],[106,8,106,9],[107,8,107,9],[100,8,100,9],[101,8,101,9],[102,8,102,9],[103,8,103,9],[103,10,103,11],[112,10,112,11],[113,10,113,11],[96,10,96,11],[97,10,97,11],[98,10,98,11],[99,10,99,11],[92,10,92,11],[93,10,93,11],[94,10,94,11],[95,10,95,11],[104,10,104,11],[114,10,114,11],[115,10,115,11],[108,10,108,11],[109,10,109,11],[110,10,110,11],[111,10,111,11],[96,12,96,13],[97,12,97,13],[98,12,98,13],[99,12,99,13],[112,12,112,13],[113,12,113,13],[114,12,114,13],[115,12,115,13],[108,12,108,13],[109,12,109,13],[110,12,110,13],[111,12,111,13],[105,10,105,11],[106,10,106,11],[107,10,107,11],[100,10,100,11],[101,10,101,11],[102,10,102,11],[92,12,92,13],[93,12,93,13],[94,12,94,13],[95,12,95,13],[104,12,104,13],[105,12,105,13],[106,12,106,13],[107,12,107,13],[100,12,100,13],[101,12,101,13],[102,12,102,13],[103,12,103,13],[103,14,103,15],[112,14,112,15],[113,14,113,15],[96,14,96,15],[97,14,97,15],[98,14,98,15],[99,14,99,15],[92,14,92,15],[93,14,93,15],[94,14,94,15],[95,14,95,15],[104,14,104,15],[114,14,114,15],[115,14,115,15],[108,14,108,15],[109,14,109,15],[110,14,110,15],[111,14,111,15],[96,16,96,17],[97,16,97,17],[98,16,98,17],[99,16,99,17],[112,16,112,17],[113,16,113,17],[114,16,114,17],[115,16,115,17],[108,16,108,17],[109,16,109,17],[110,16,110,17],[111,16,111,17],[105,14,105,15],[106,14,106,15],[107,14,107,15],[100,14,100,15],[101,14,101,15],[102,14,102,15],[92,16,92,17],[93,16,93,17],[94,16,94,17],[95,16,95,17],[104,16,104,17],[105,16,105,17],[106,16,106,17],[107,16,107,17],[100,16,100,17],[101,16,101,17],[102,16,102,17],[103,16,103,17],[127,6,127,7],[136,6,136,7],[137,6,137,7],[120,6,120,7],[121,6,121,7],[122,6,122,7],[123,6,123,7],[116,6,116,7],[117,6,117,7],[118,6,118,7],[119,6,119,7],[128,6,128,7],[138,6,138,7],[139,6,139,7],[132,6,132,7],[133,6,133,7],[134,6,134,7],[135,6,135,7],[120,8,120,9],[121,8,121,9],[122,8,122,9],[123,8,123,9],[136,8,136,9],[137,8,137,9],[138,8,138,9],[139,8,139,9],[132,8,132,9],[133,8,133,9],[134,8,134,9],[135,8,135,9],[129,6,129,7],[130,6,130,7],[131,6,131,7],[124,6,124,7],[125,6,125,7],[126,6,126,7],[116,8,116,9],[117,8,117,9],[118,8,118,9],[119,8,119,9],[128,8,128,9],[129,8,129,9],[130,8,130,9],[131,8,131,9],[124,8,124,9],[125,8,125,9],[126,8,126,9],[127,8,127,9],[127,10,127,11],[136,10,136,11],[137,10,137,11],[120,10,120,11],[121,10,121,11],[122,10,122,11],[123,10,123,11],[116,10,116,11],[117,10,117,11],[118,10,118,11],[119,10,119,11],[128,10,128,11],[138,10,138,11],[139,10,139,11],[132,10,132,11],[133,10,133,11],[134,10,134,11],[135,10,135,11],[120,12,120,13],[121,12,121,13],[122,12,122,13],[123,12,123,13],[136,12,136,13],[137,12,137,13],[138,12,138,13],[139,12,139,13],[132,12,132,13],[133,12,133,13],[134,12,134,13],[135,12,135,13],[129,10,129,11],[130,10,130,11],[131,10,131,11],[124,10,124,11],[125,10,125,11],[126,10,126,11],[116,12,116,13],[117,12,117,13],[118,12,118,13],[119,12,119,13],[128,12,128,13],[129,12,129,13],[130,12,130,13],[131,12,131,13],[124,12,124,13],[125,12,125,13],[126,12,126,13],[127,12,127,13],[127,14,127,15],[136,14,136,15],[137,14,137,15],[120,14,120,15],[121,14,121,15],[122,14,122,15],[123,14,123,15],[116,14,116,15],[117,14,117,15],[118,14,118,15],[119,14,119,15],[128,14,128,15],[138,14,138,15],[139,14,139,15],[132,14,132,15],[133,14,133,15],[134,14,134,15],[135,14,135,15],[120,16,120,17],[121,16,121,17],[122,16,122,17],[123,16,123,17],[136,16,136,17],[137,16,137,17],[138,16,138,17],[139,16,139,17],[132,16,132,17],[133,16,133,17],[134,16,134,17],[135,16,135,17],[129,14,129,15],[130,14,130,15],[131,14,131,15],[124,14,124,15],[125,14,125,15],[126,14,126,15],[116,16,116,17],[117,16,117,17],[118,16,118,17],[119,16,119,17],[128,16,128,17],[129,16,129,17],[130,16,130,17],[131,16,131,17],[124,16,124,17],[125,16,125,17],[126,16,126,17],[127,16,127,17]]}
[]
[]
[null,null,null,null,"Input Worksheet for Crossroad Ramp Terminals"]
[null,null,null,null,null,null,{"$f":"\"Terminal \"& TEXT(INT((COLUMN()-5)/2),\"0\")","v":"Terminal 1"},null,{"$f":"\"Terminal \"& TEXT(INT((COLUMN()-5)/2),\"0\")","v":"Terminal 2"},null,{"$f":"\"Terminal \"& TEXT(INT((COLUMN()-5)/2),\"0\")","v":"Terminal 3"},null,{"$f":"\"Terminal \"& TEXT(INT((COLUMN()-5)/2),\"0\")","v":"Terminal 4"},null,{"$f":"\"Terminal \"& TEXT(INT((COLUMN()-5)/2),\"0\")","v":"Terminal 5"},null,{"$f":"\"Terminal \"& TEXT(INT((COLUMN()-5)/2),\"0\")","v":"Terminal 6"},null,null,{"$f":"G4","v":"Terminal 1"},null,{"$f":"I4","v":"Terminal 2"},null,{"$f":"K4","v":"Terminal 3"},null,{"$f":"M4","v":"Terminal 4"},null,{"$f":"O4","v":"Terminal 5"},null,{"$f":"Q4","v":"Terminal 6"}]
[null,null,null,null,null,null,{"$f":"IF(Main!$AK$14=TRUE, \"Crash Period\", \"Study Period\")","v":"Crash Period"},{"$f":"IF(Main!$AK$14=TRUE, \"Study Period\", \"\")","v":"Study Period"},{"$f":"G5","v":"Crash Period"},"Study Period","Crash Period","Study Period","Crash Period","Study Period","Crash Period","Study Period","Crash Period","Study Period",null,{"$f":"G5","v":"Crash Period"},{"$f":"H5","v":"Study Period"},{"$f":"I5","v":"Crash Period"},{"$f":"J5","v":"Study Period"},{"$f":"K5","v":"Crash Period"},{"$f":"L5","v":"Study Period"},{"$f":"M5","v":"Crash Period"},{"$f":"N5","v":"Study Period"},{"$f":"O5","v":"Crash Period"},{"$f":"P5","v":"Study Period"},{"$f":"Q5","v":"Crash Period"},{"$f":"R5","v":"Study Period"}]
[null,null,"      (View results in Column T)","(View results in Advisory Messages)"]
[null,"Basic Intersection Data"]
[null,"Ramp terminal configuration:",null,null,null,null,"D4",{"$f":"G8","v":"D4"},"A2",{"$f":"I8","v":"A2"},"D3ex",{"$f":"K8","v":"D3ex"},"D4",{"$f":"M8","v":"D4"},"B4",{"$f":"O8","v":"B4"},"A4",{"$f":"Q8","v":"A4"},null,"D4","D4","A2","A2","D3ex","D3ex","D4","D4","B4","B4","A4","A4"]
[null,"Ramp terminal description:",null,null,null,null,"NB exit ramp at Main",null,"SB exit ramp at Main",null,null,"Alt 1",null,null,null,null,null,null,null,"NB exit ramp at Main",null,"SB exit ramp at Main",null,null,"Alt 1"]
[null,"Ramp terminal traffic control type:",null,null,null,null,"Signal",{"$f":"G10","v":"Signal"},"One stop",{"$f":"I10","v":"One stop"},"One stop",{"$f":"K10","v":"One stop"},"All stop",{"$f":"M10","v":"All stop"},"One stop",{"$f":"O10","v":"One stop"},"Signal",{"$f":"Q10","v":"Signal"},null,"Signal","Signal","One stop","One stop","One stop","One stop","All stop","All stop","One stop","One stop","Signal","Signal"]
[null,"Is a non-ramp public street leg present at the terminal (Ips)?:",null,null,null,null,"No",{"$f":"G11","v":"No"},null,{"$f":"I11","v":0},null,{"$f":"K11","v":0},null,{"$f":"M11","v":0},null,{"$f":"O11","v":0},"No",{"$f":"Q11","v":"No"},null,"No","No",null,null,null,null,null,null,null,null,"No","No"]
[null,"Alignment Data"]
[null,"Exit ramp skew angle (Isk), degrees:",null,null,null,null,2,{"$f":"G13","v":2},1,{"$f":"I13","v":1},15,{"$f":"K13","v":15},35,{"$f":"M13","v":35},52,{"$f":"O13","v":52},null,{"$f":"Q13","v":0},null,0,0,1,1,15,15,0,0,52,52,0,0]
[null,"Distance to the next public street intersection on the outside crossroad leg (Lstr), mi:",null,null,null,null,0.14000000000000001,{"$f":"G14","v":0.14000000000000001},0.13,{"$f":"I14","v":0.13},0.56999999999999995,{"$f":"K14","v":0.56999999999999995},0.55000000000000004,{"$f":"M14","v":0.55000000000000004},0.12,{"$f":"O14","v":0.12},7.4999999999999997E-2,{"$f":"Q14","v":7.4999999999999997E-2},null,0.14000000059604645,0.14000000059604645,0.12999999523162842,0.12999999523162842,0.56999999284744263,0.56999999284744263,0.55000001192092896,0.55000001192092896,0.11999999731779099,0.11999999731779099,7.5000002980232239E-2,7.5000002980232239E-2]
[null,"Distance to the adjacent ramp terminal (Lrmp), mi:",null,null,null,null,0.12,{"$f":"G15","v":0.12},0.15,{"$f":"I15","v":0.15},0.15,{"$f":"K15","v":0.15},8.5000000000000006E-2,{"$f":"M15","v":8.5000000000000006E-2},0.16,{"$f":"O15","v":0.16},0.17,{"$f":"Q15","v":0.17},null,0.11999999731779099,0.11999999731779099,0.15000000596046448,0.15000000596046448,0.15000000596046448,0.15000000596046448,8.5000000894069672E-2,8.5000000894069672E-2,0.15999999642372131,0.15999999642372131,0.17000000178813934,0.17000000178813934]
[null,"Traffic Control"]
[null,"Left-Turn Operational Mode"]
[null,"Crossroad","Inside approach","Protected-only mode (Ip,lt,in)?:",null,null,"Yes",{"$f":"G18","v":"Yes"},null,{"$f":"I18","v":0},null,{"$f":"K18","v":0},null,{"$f":"M18","v":0},null,{"$f":"O18","v":0},null,{"$f":"Q18","v":0},null,"Yes","Yes"]
[null,null,"Outside approach","Protected-only mode (Ip,lt,out)?:",null,null,null,{"$f":"G19","v":0},null,{"$f":"I19","v":0},null,{"$f":"K19","v":0},null,{"$f":"M19","v":0},null,{"$f":"O19","v":0},null,{"$f":"Q19","v":0}]
[null,"Right-Turn Control Type"]
[null,"Ramp","Exit ramp approach","Right-turn control type:",null,null,"Signal",{"$f":"G21","v":"Signal"},"Stop",{"$f":"I21","v":"Stop"},"Stop",{"$f":"K21","v":"Stop"},"Stop",{"$f":"M21","v":"Stop"},"Stop",{"$f":"O21","v":"Stop"},"Yield",{"$f":"Q21","v":"Yield"},null,"Signal","Signal","Stop","Stop","Stop","Stop","Stop","Stop","Stop","Stop","Yield","Yield"]
[null,"Cross Section Data"]
[null,"Crossroad median width (Wm), ft:",null,null,null,null,12,{"$f":"G23","v":12},15,{"$f":"I23","v":15},16,{"$f":"K23","v":16},0,{"$f":"M23","v":0},12,{"$f":"O23","v":12},0,{"$f":"Q23","v":0},null,12,12,15,15,16,16,0,0,12,12,0,0]
[null,"Number of Lanes"]
[null,"Crossroad","Both approaches","Lanes serving through vehicles (nth):",null,null,4,{"$f":"G25","v":4},2,{"$f":"I25","v":2},4,{"$f":"K25","v":4},2,{"$f":"M25","v":2},2,{"$f":"O25","v":2},5,{"$f":"Q25","v":5},null,4,4,2,2,4,4,2,2,2,2,5,5]
[null,null,"Inside approach","Lanes serving through vehicles (nth,in):",null,null,2,{"$f":"G26","v":2},null,{"$f":"I26","v":0},null,{"$f":"K26","v":0},null,{"$f":"M26","v":0},null,{"$f":"O26","v":0},2,{"$f":"Q26","v":2},null,2,2,0,0,0,0,0,0,0,0,2,2]
[null,null,"Outside approach","Lanes serving through vehicles (nth,out):",null,null,{"$f":"G25-G26","v":2},{"$f":"H25-H26","v":2},{"$f":"I25-I26","v":2},2,4,4,2,2,2,2,3,3,null,2,2,0,0,0,0,0,0,0,0,3,3]
[null,"Ramp","Exit ramp approach","All lanes (nex):",null,null,3,{"$f":"G28","v":3},1,{"$f":"I28","v":1},1,{"$f":"K28","v":1},1,{"$f":"M28","v":1},1,{"$f":"O28","v":1},2,{"$f":"Q28","v":2},null,3,3,1,1,1,1,1,1,1,1,2,2]
[null,"Right-Turn Channelization",null,null,"         see note:"]
[null,"Crossroad","Inside approach","Channelization present (Ich,in)?:",null,null,null,{"$f":"G30","v":0},null,{"$f":"I30","v":0},null,{"$f":"K30","v":0},null,{"$f":"M30","v":0},null,{"$f":"O30","v":0},"No",{"$f":"Q30","v":"No"},null,null,null,null,null,null,null,null,null,null,null,"No","No"]
[null,null,"Outside approach","Channelization present (Ich,out)?:",null,null,"Yes",{"$f":"G31","v":"Yes"},null,{"$f":"I31","v":0},null,{"$f":"K31","v":0},null,{"$f":"M31","v":0},null,{"$f":"O31","v":0},"No",{"$f":"Q31","v":"No"},null,"Yes","Yes",null,null,null,null,null,null,null,null,"No","No"]
[null,"Ramp","Exit ramp approach","Channelization present (Ich,ex)?:",null,null,"No",{"$f":"G32","v":"No"},null,{"$f":"I32","v":0},null,{"$f":"K32","v":0},null,{"$f":"M32","v":0},null,{"$f":"O32","v":0},"Yes",{"$f":"Q32","v":"Yes"},null,"No","No",null,null,null,null,null,null,null,null,"Yes","Yes"]
[null,"Left-Turn Lane or Bay"]
[null,"Crossroad","Inside approach","Lane or bay present (Ibay,lt,in)?:",null,null,"Yes",{"$f":"G34","v":"Yes"},null,{"$f":"I34","v":0},null,{"$f":"K34","v":0},null,{"$f":"M34","v":0},"Yes",{"$f":"O34","v":"Yes"},null,{"$f":"Q34","v":0},null,"Yes","Yes",null,null,null,null,null,null,"Yes","Yes"]
[null,null,null,"Width of lane or bay (Wb,in), ft:",null,null,10,{"$f":"G35","v":10},null,{"$f":"I35","v":0},null,{"$f":"K35","v":0},null,{"$f":"M35","v":0},10,{"$f":"O35","v":10},null,{"$f":"Q35","v":0},null,10,10,0,0,0,0,0,0,10,10,0,0]
[null,null,"Outside approach","Lane or bay present (Ibay,lt,out)?:",null,null,null,{"$f":"G36","v":0},"Yes",{"$f":"I36","v":"Yes"},null,{"$f":"K36","v":0},null,{"$f":"M36","v":0},null,{"$f":"O36","v":0},null,{"$f":"Q36","v":0},null,null,null,"Yes","Yes"]
[null,null,null,"Width of lane or bay (Wb,out), ft:",null,null,null,{"$f":"G37","v":0},12,{"$f":"I37","v":12},null,{"$f":"K37","v":0},null,{"$f":"M37","v":0},null,{"$f":"O37","v":0},null,{"$f":"Q37","v":0},null,0,0,12,12,0,0,0,0,0,0,0,0]
[null,"Right-Turn Lane or Bay"]
[null,"Crossroad","Inside approach","Lane or bay present (Ibay,rt,in)?:",null,null,null,{"$f":"G39","v":0},"Yes",{"$f":"I39","v":"Yes"},null,{"$f":"K39","v":0},null,{"$f":"M39","v":0},null,{"$f":"O39","v":0},"Yes",{"$f":"Q39","v":"Yes"},null,null,null,"Yes","Yes",null,null,null,null,null,null,"Yes","Yes"]
[null,null,"Outside approach","Lane or bay present (Ibay,rt,out)?:",null,null,"Yes",{"$f":"G40","v":"Yes"},null,{"$f":"I40","v":0},null,{"$f":"K40","v":0},null,{"$f":"M40","v":0},"No",{"$f":"O40","v":"No"},"Yes",{"$f":"Q40","v":"Yes"},null,"Yes","Yes",null,null,null,null,null,null,"No","No","Yes","Yes"]
[null,"Access Data"]
[null,"Number of driveways on the outside crossroad leg (ndw):",null,null,null,null,1,{"$f":"G42","v":1},null,{"$f":"I42","v":0},null,{"$f":"K42","v":0},null,{"$f":"M42","v":0},null,{"$f":"O42","v":0},3,{"$f":"Q42","v":3},null,1,1,0,0,0,0,0,0,0,0,3,3]
[null,"Number of public street approaches on the outside crossroad leg (nps):",null,null,null,null,2,{"$f":"G43","v":2},1,{"$f":"I43","v":1},0,{"$f":"K43","v":0},0,{"$f":"M43","v":0},0,{"$f":"O43","v":0},0,{"$f":"Q43","v":0},null,0,0,0,0,0,0,0,0,0,0,0,0]
[null,"Traffic Data",null,null,null,"Year"]
[null,"Inside Crossroad Leg Data ",null,null,null,{"$f":"Main!AK5","v":2005},49887,null,6985,null,null,null,3677,null,8814,null,23500,null,null,49887,null,6985,null,0,null,3677,null,8814,null,23500]
[null,"Average daily traffic (AADTin) by year, veh/d:",null,null,null,{"$f":"F45+1","v":2006},null,null,7000,null,null,null,null,null,null,null,null,null,null,0,null,7000,null,0,null,0,null,0,null,0]
[null," (enter data only for those years for which",null,null,null,{"$f":"F46+1","v":2007},50000,null,null,null,7142,null,null,null,null,null,null,null,null,50000,null,0,null,7142,null,0,null,0,null,0]
[null,"  it is available, leave other years blank)",null,null,null,2008,null,null,null,null,null,null,null,null,null,null,null,null,null,0,null,0,null,0,null,0,null,0,null,0]
[null,null,null,null,null,2009,null,null,null,null,null,null,null,null,null,null,null,null,null,0,null,0,null,0,null,0,null,0,null,0]
[null,null,null,null,null,2010,null,null,null,null,null,null,null,null,null,null,null,null,null,0,null,0,null,0,null,0,null,0,null,0]
[null,null,null,null,null,2011,null,null,null,null,null,null,null,null,null,null,null,null,null,0,null,0,null,0,null,0,null,0,null,0]
[null,null,null,null,null,2012,null,null,null,null,null,null,null,null,null,null,null,null,null,0,null,0,null,0,null,0,null,0,null,0]
[null,null,null,null,null,2013,null,null,null,null,null,null,null,null,null,null,null,null,null,0,null,0,null,0,null,0,null,0,null,0]
[null,null,null,null,null,2014,52000,null,null,null,null,null,null,null,null,null,null,null,null,52000,null,0,null,0,null,0,null,0,null,0]
[null,null,null,null,null,2015,null,null,null,null,null,null,null,null,null,null,null,null,null,0,null,0,null,0,null,0,null,0,null,0]
[null,null,null,null,null,2016,null,null,null,null,null,null,null,null,null,null,null,null,null,0,null,0,null,0,null,0,null,0,null,0]
[null,null,null,null,null,2017,null,null,null,null,null,null,null,null,null,null,null,null,null,0,null,0,null,0,null,0,null,0,null,0]
[null,null,null,null,null,2018,null,null,null,null,null,null,null,null,null,null,null,null,null,0,null,0,null,0,null,0,null,0,null,0]
[null,null,null,null,null,2019,null,null,null,null,null,null,null,null,null,null,null,null,null,0,null,0,null,0,null,0,null,0,null,0]
[null,null,null,null,null,2020,null,null,null,null,null,null,null,null,null,null,null,null,null,0,null,0,null,0,null,0,null,0,null,0]
[null,null,null,null,null,2021,null,null,null,null,null,null,null,null,null,null,null,null,null,0,null,0,null,0,null,0,null,0,null,0]
[null,null,null,null,null,2022,null,null,null,null,null,null,null,null,null,null,null,null,null,0,null,0,null,0,null,0,null,0,null,0]
[null,null,null,null,null,2023,null,null,null,null,null,null,null,null,null,null,null,null,null,0,null,0,null,0,null,0,null,0,null,0]
[null,null,null,null,null,2024,null,null,null,null,null,null,null,null,null,null,null,null,null,0,null,0,null,0,null,0,null,0,null,0]
[null,null,null,null,null,2025,null,null,null,null,null,null,null,null,null,null,null,null,null,0,null,0,null,0,null,0,null,0,null,0]
[null,null,null,null,null,2026,null,null,null,null,null,null,null,null,null,null,null,null,null,0,null,0,null,0,null,0,null,0,null,0]
[null,null,null,null,null,2027,null,null,null,null,null,null,null,null,null,null,null,null,null,0,null,0,null,0,null,0,null,0,null,0]
[null,null,null,null,null,2028,null,null,null,null,null,null,null,null,null,null,null,null,null,0,null,0,null,0,null,0,null,0,null,0]
[null,"Outside Crossroad Leg Data ",null,null,null,{"$f":"F45","v":2005},49887,null,null,null,null,null,3677,null,8814,null,null,null,null,49887,null,0,null,0,null,3677,null,8814,null,0]
[null,"Average daily traffic (AADTout) by year, veh/d:",null,null,null,{"$f":"F69+1","v":2006},null,null,6985,null,7142,null,null,null,null,null,null,null,null,0,null,6985,null,7142,null,0,null,0,null,0]
[null," (enter data only for those years for which",null,null,null,{"$f":"F70+1","v":2007},50000,null,7000,null,7142,null,null,null,null,null,23500,null,null,50000,null,7000,null,7142,null,0,null,0,null,23500]
[null,"  it is available, leave other years blank)",null,null,null,2008,null,null,null,null,null,null,null,null,null,null,null,null,null,0,null,0,null,0,null,0,null,0,null,0]
[null,null,null,null,null,2009,null,null,null,null,null,null,null,null,null,null,null,null,null,0,null,0,null,0,null,0,null,0,null,0]
[null,null,null,null,null,2010,null,null,null,null,null,null,null,null,null,null,null,null,null,0,null,0,null,0,null,0,null,0,null,0]
[null,null,null,null,null,2011,null,null,null,null,null,null,null,null,null,null,null,null,null,0,null,0,null,0,null,0,null,0,null,0]
[null,null,null,null,null,2012,null,null,null,null,null,null,null,null,null,null,null,null,null,0,null,0,null,0,null,0,null,0,null,0]
[null,null,null,null,null,2013,null,null,null,null,null,null,null,null,null,null,null,null,null,0,null,0,null,0,null,0,null,0,null,0]
[null,null,null,null,null,2014,null,null,null,null,null,null,null,null,null,null,null,null,null,0,null,0,null,0,null,0,null,0,null,0]
[null,null,null,null,null,2015,null,null,null,null,null,null,null,null,null,null,null,null,null,0,null,0,null,0,null,0,null,0,null,0]
[null,null,null,null,null,2016,null,null,null,null,null,null,null,null,null,null,null,null,null,0,null,0,null,0,null,0,null,0,null,0]
[null,null,null,null,null,2017,null,null,null,null,null,null,null,null,null,null,null,null,null,0,null,0,null,0,null,0,null,0,null,0]
[null,null,null,null,null,2018,null,null,null,null,null,null,null,null,null,null,null,null,null,0,null,0,null,0,null,0,null,0,null,0]
[null,null,null,null,null,2019,null,null,null,null,null,null,null,null,null,null,null,null,null,0,null,0,null,0,null,0,null,0,null,0]
[null,null,null,null,null,2020,null,null,null,null,null,null,null,null,null,null,null,null,null,0,null,0,null,0,null,0,null,0,null,0]
[null,null,null,null,null,2021,null,null,null,null,null,null,null,null,null,null,null,null,null,0,null,0,null,0,null,0,null,0,null,0]
[null,null,null,null,null,2022,null,null,null,null,null,null,null,null,null,null,null,null,null,0,null,0,null,0,null,0,null,0,null,0]
[null,null,null,null,null,2023,null,null,null,null,null,null,null,null,null,null,null,null,null,0,null,0,null,0,null,0,null,0,null,0]
[null,null,null,null,null,2024,null,null,null,null,null,null,null,null,null,null,null,null,null,0,null,0,null,0,null,0,null,0,null,0]
[null,null,null,null,null,2025,null,null,null,null,null,null,null,null,null,null,null,null,null,0,null,0,null,0,null,0,null,0,null,0]
[null,null,null,null,null,2026,null,null,null,null,null,null,null,null,null,null,null,null,null,0,null,0,null,0,null,0,null,0,null,0]
[null,null,null,null,null,2027,null,null,null,null,null,null,null,null,null,null,null,null,null,0,null,0,null,0,null,0,null,0,null,0]
[null,null,null,null,null,2028,null,null,null,null,null,null,null,null,null,null,null,null,null,0,null,0,null,0,null,0,null,0,null,0]
[null,"Exit Ramp Data ",null,null,null,{"$f":"F69","v":2005},12683,null,806,null,2580,null,958,null,1782,null,null,null,null,12683,null,806,null,2580,null,958,null,1782,null,0]
[null,"Average daily traffic (AADTex) by year, veh/d:",null,null,null,{"$f":"F93+1","v":2006},null,null,null,null,2580,null,null,null,null,null,2550,null,null,0,null,0,null,2580,null,0,null,0,null,2550]
[null," (enter data only for those years for which",null,null,null,{"$f":"F94+1","v":2007},null,null,null,null,2580,null,null,null,null,null,null,null,null,0,null,0,null,2580,null,0,null,0,null,0]
[null,"  it is available, leave other years blank)",null,null,null,2008,null,null,null,null,null,null,null,null,null,null,null,null,null,0,null,0,null,0,null,0,null,0,null,0]
[null,null,null,null,null,2009,null,null,null,null,null,null,null,null,null,null,null,null,null,0,null,0,null,0,null,0,null,0,null,0]
[null,"For a B4 terminal configuration, enter the AADT for the ",null,null,null,2010,null,null,null,null,null,null,null,null,null,null,null,null,null,0,null,0,null,0,null,0,null,0,null,0]
[null,"diagonal exit ramp (not the loop exit ramp).",null,null,null,2011,null,null,null,null,null,null,null,null,null,null,null,null,null,0,null,0,null,0,null,0,null,0,null,0]
[null,null,null,null,null,2012,null,null,null,null,null,null,null,null,null,null,null,null,null,0,null,0,null,0,null,0,null,0,null,0]
[null,null,null,null,null,2013,null,null,null,null,null,null,null,null,null,null,null,null,null,0,null,0,null,0,null,0,null,0,null,0]
[null,null,null,null,null,2014,null,null,null,null,null,null,null,null,null,null,null,null,null,0,null,0,null,0,null,0,null,0,null,0]
[null,null,null,null,null,2015,null,null,null,null,null,null,null,null,null,null,null,null,null,0,null,0,null,0,null,0,null,0,null,0]
[null,null,null,null,null,2016,null,null,null,null,null,null,null,null,null,null,null,null,null,0,null,0,null,0,null,0,null,0,null,0]
[null,null,null,null,null,2017,null,null,null,null,null,null,null,null,null,null,null,null,null,0,null,0,null,0,null,0,null,0,null,0]
[null,null,null,null,null,2018,null,null,null,null,null,null,null,null,null,null,null,null,null,0,null,0,null,0,null,0,null,0,null,0]
[null,null,null,null,null,2019,null,null,null,null,null,null,null,null,null,null,null,null,null,0,null,0,null,0,null,0,null,0,null,0]
[null,null,null,null,null,2020,null,null,null,null,null,null,null,null,null,null,null,null,null,0,null,0,null,0,null,0,null,0,null,0]
[null,null,null,null,null,2021,null,null,null,null,null,null,null,null,null,null,null,null,null,0,null,0,null,0,null,0,null,0,null,0]
[null,null,null,null,null,2022,null,null,null,null,null,null,null,null,null,null,null,null,null,0,null,0,null,0,null,0,null,0,null,0]
[null,null,null,null,null,2023,null,null,null,null,null,null,null,null,null,null,null,null,null,0,null,0,null,0,null,0,null,0,null,0]
[null,null,null,null,null,2024,null,null,null,null,null,null,null,null,null,null,null,null,null,0,null,0,null,0,null,0,null,0,null,0]
[null,null,null,null,null,2025,null,null,null,null,null,null,null,null,null,null,null,null,null,0,null,0,null,0,null,0,null,0,null,0]
[null,null,null,null,null,2026,null,null,null,null,null,null,null,null,null,null,null,null,null,0,null,0,null,0,null,0,null,0,null,0]
[null,null,null,null,null,2027,null,null,null,null,null,null,null,null,null,null,null,null,null,0,null,0,null,0,null,0,null,0,null,0]
[null,null,null,null,null,2028,null,null,null,null,null,null,null,null,null,null,null,null,null,0,null,0,null,0,null,0,null,0,null,0]
[null,"Entrance Ramp Data ",null,null,null,{"$f":"F93","v":2005},null,null,null,null,null,null,3437,null,null,null,5900,null,null,0,null,0,null,0,null,3437,null,0,null,5900]
[null,"Average daily traffic (AADTen) by year, veh/d:",null,null,null,{"$f":"F117+1","v":2006},null,null,4050,null,null,null,null,null,4610,null,null,null,null,0,null,4050,null,0,null,0,null,4610,null,0]
[null," (enter data only for those years for which",null,null,null,{"$f":"F118+1","v":2007},7807,null,null,null,null,null,null,null,null,null,null,null,null,7807,null,0,null,0,null,0,null,0,null,0]
[null,"  it is available, leave other years blank)",null,null,null,2008,null,null,null,null,null,null,null,null,null,null,null,null,null,0,null,0,null,0,null,0,null,0,null,0]
[null,null,null,null,null,2009,null,null,null,null,null,null,null,null,null,null,null,null,null,0,null,0,null,0,null,0,null,0,null,0]
[null,"For an A4 terminal configuration, enter the AADT for the ",null,null,null,2010,null,null,null,null,null,null,null,null,null,null,null,null,null,0,null,0,null,0,null,0,null,0,null,0]
[null,"diagonal entrance ramp (not the loop entrance ramp).",null,null,null,2011,null,null,null,null,null,null,null,null,null,null,null,null,null,0,null,0,null,0,null,0,null,0,null,0]
[null,null,null,null,null,2012,null,null,null,null,null,null,null,null,null,null,null,null,null,0,null,0,null,0,null,0,null,0,null,0]
[null,null,null,null,null,2013,null,null,null,null,null,null,null,null,null,null,null,null,null,0,null,0,null,0,null,0,null,0,null,0]
[null,null,null,null,null,2014,null,null,null,null,null,null,null,null,null,null,null,null,null,0,null,0,null,0,null,0,null,0,null,0]
[null,null,null,null,null,2015,null,null,null,null,null,null,null,null,null,null,null,null,null,0,null,0,null,0,null,0,null,0,null,0]
[null,null,null,null,null,2016,null,null,null,null,null,null,null,null,null,null,null,null,null,0,null,0,null,0,null,0,null,0,null,0]
[null,null,null,null,null,2017,null,null,null,null,null,null,null,null,null,null,null,null,null,0,null,0,null,0,null,0,null,0,null,0]
[null,null,null,null,null,2018,null,null,null,null,null,null,null,null,null,null,null,null,null,0,null,0,null,0,null,0,null,0,null,0]
[null,null,null,null,null,2019,null,null,null,null,null,null,null,null,null,null,null,null,null,0,null,0,null,0,null,0,null,0,null,0]
[null,null,null,null,null,2020,null,null,null,null,null,null,null,null,null,null,null,null,null,0,null,0,null,0,null,0,null,0,null,0]
[null,null,null,null,null,2021,null,null,null,null,null,null,null,null,null,null,null,null,null,0,null,0,null,0,null,0,null,0,null,0]
[null,null,null,null,null,2022,null,null,null,null,null,null,null,null,null,null,null,null,null,0,null,0,null,0,null,0,null,0,null,0]
[null,null,null,null,null,2023,null,null,null,null,null,null,null,null,null,null,null,null,null,0,null,0,null,0,null,0,null,0,null,0]
[null,null,null,null,null,2024,null,null,null,null,null,null,null,null,null,null,null,null,null,0,null,0,null,0,null,0,null,0,null,0]
[null,null,null,null,null,2025,null,null,null,null,null,null,null,null,null,null,null,null,null,0,null,0,null,0,null,0,null,0,null,0]
[null,null,null,null,null,2026,null,null,null,null,null,null,null,null,null,null,null,null,null,0,null,0,null,0,null,0,null,0,null,0]
[null,null,null,null,null,2027,null,null,null,null,null,null,null,null,null,null,null,null,null,0,null,0,null,0,null,0,null,0,null,0]
[null,null,null,null,null,2028,null,null,null,null,null,null,null,null,null,null,null,null,null,0,null,0,null,0,null,0,null,0,null,0]
[null,"Crash Data",null,null,"Year",{"$f":"IF(Main!$AK$15=TRUE, \"Project Crashes\", \"\")","v":""},"Ramp Terminal Crashes -->"]
[null,"Count of Fatal-and-Injury (FI) Crashes by Year"]
[null,null,"(No,w,ac,at,fi)",null,{"$f":"Main!AK7","v":2005},15,12,null,0,null,0,null,0,null,2,null,1,null,null,12,null,0,null,0,null,0,null,2,null,1]
[null,null,null,null,{"$f":"E143+1","v":2006},17,12,null,1,null,0,null,0,null,2,null,2,null,null,12,null,1,null,0,null,0,null,2,null,2]
[null,null,null,null,{"$f":"E144+1","v":2007},16,12,null,1,null,0,null,0,null,2,null,1,null,null,12,null,1,null,0,null,0,null,2,null,1]
[null,null,null,null,{"$f":"E145+1","v":2008},null,null,null,null,null,null,null,null,null,null,null,null,null,null,0,null,0,null,0,null,0,null,0,null,0]
[null,null,null,null,{"$f":"E146+1","v":2009},null,null,null,null,null,null,null,null,null,null,null,null,null,null,0,null,0,null,0,null,0,null,0,null,0]
[null,"Count of Property-Damage-Only (PDO) Crashes by Year"]
[null,null,"(No,w,ac,at,pdo)",null,{"$f":"E143","v":2005},14,10,null,0,null,1,null,0,null,1,null,2,null,null,10,null,0,null,1,null,0,null,1,null,2]
[null,null,null,null,{"$f":"E144","v":2006},15,10,null,1,null,1,null,0,null,1,null,2,null,null,10,null,1,null,1,null,0,null,1,null,2]
[null,null,null,null,{"$f":"E145","v":2007},13,10,null,0,null,0,null,0,null,0,null,3,null,null,10,null,0,null,0,null,0,null,0,null,3]
[null,null,null,null,{"$f":"E146","v":2008},null,null,null,null,null,null,null,null,null,null,null,null,null,null,0,null,0,null,0,null,0,null,0,null,0]
[null,null,null,null,{"$f":"E147","v":2009},null,null,null,null,null,null,null,null,null,null,null,null,null,null,0,null,0,null,0,null,0,null,0,null,0]
[]
[null,"Advisory Messages"]
[]
[]
[]
[]
[]
[]
[]
[]
[]
[]
[]
[]
[]
[]
[]
[]
[]
[]
[]
[]
[]
[]
[]
[]
[null,"Variable Limits"]
[null,{"$f":"B24","v":"Number of Lanes"}]
[null,null,{"$f":"C25","v":"Both approaches"},null,null,null,{"$f":"IF(AND(Main!$K$6= \"Urban\", G$10=\"Signal\"),6, 4)","v":6},{"$f":"IF(AND(Main!$K$6= \"Urban\", H$10=\"Signal\"),6, 4)","v":6},{"$f":"IF(AND(Main!$K$6= \"Urban\", I$10=\"Signal\"),6, 4)","v":4},{"$f":"IF(AND(Main!$K$6= \"Urban\", J$10=\"Signal\"),6, 4)","v":4},{"$f":"IF(AND(Main!$K$6= \"Urban\", K$10=\"Signal\"),6, 4)","v":4},{"$f":"IF(AND(Main!$K$6= \"Urban\", L$10=\"Signal\"),6, 4)","v":4},{"$f":"IF(AND(Main!$K$6= \"Urban\", M$10=\"Signal\"),6, 4)","v":4},{"$f":"IF(AND(Main!$K$6= \"Urban\", N$10=\"Signal\"),6, 4)","v":4},{"$f":"IF(AND(Main!$K$6= \"Urban\", O$10=\"Signal\"),6, 4)","v":4},{"$f":"IF(AND(Main!$K$6= \"Urban\", P$10=\"Signal\"),6, 4)","v":4},{"$f":"IF(AND(Main!$K$6= \"Urban\", Q$10=\"Signal\"),6, 4)","v":6},{"$f":"IF(AND(Main!$K$6= \"Urban\", R$10=\"Signal\"),6, 4)","v":6}]
[null,null,{"$f":"B28","v":"Ramp"},null,null,null,{"$f":"IF(G$10=\"Signal\",4, 2)","v":4},4,2,2,2,2,2,2,2,2,4,4]

{"sheet":"Output Summary","index":6,"n_rows":64,"n_cols":23,"rows_kept":64,"cut":false,"hidden":false,"merged":[[2,13,2,23],[4,15,4,23],[5,15,5,16],[5,18,5,19],[5,22,5,23],[29,3,29,4],[49,1,50,2],[49,3,50,5],[2,1,2,11],[4,3,4,11],[5,3,5,4],[5,6,5,7],[5,10,5,11],[49,6,49,11]]}
[]
[]
[null,"Output Summary",null,null,null,null,null,null,null,null,null,null,null,"Evaluation Site Summary"]
[null,"General Information",null,null,null,null,null,null,null,null,null,null,null,"General Information"]
[null,"Project description:",null,{"$f":"Main!D5","v":"Sample Data"},null,null,null,null,null,null,null,null,null,"Project description:",null,{"$f":"D5","v":"Sample Data"}]
[null,"Analyst:",null,{"$f":"Main!D6","v":"JAB"},null,"Date:",{"$f":"Main!G6","v":"2023-03-08T07:17:04.850"},null,"Area type:",null,{"$f":"Main!K6","v":"Urban"},null,null,"Analyst:",null,{"$f":"D6","v":"JAB"},null,"Date:",{"$f":"G6","v":"2023-03-08T07:17:04.850"},null,"Area type:",null,{"$f":"K6","v":"Urban"}]
[null,"First year of analysis:",null,{"$f":"Main!D7","v":2013},null,null,null,null,null,null,null,null,null,"First year of analysis:",null,{"$f":"D7","v":2013},"Total length of freeway segments for Study Period (mi):",null,null,null,null,{"$f":"SUM(P13:P32)","v":0.47000000000000003}]
[null,"Last year of analysis:",null,{"$f":"Main!D8","v":2015},null,null,null,null,null,null,null,null,null,"Last year of analysis:",null,{"$f":"D8","v":2015}]
[null,"Crash Data Description",null,null,null,null,null,null,null,null,null,null,null,"Site Description"]
[null,"Freeway segments",null,"Segment crash data available?",null,null,null,"Yes","First year of crash data:",null,null,2005,null,"Freeway Segments"]
[null,null,null,"Project-level crash data available?",null,null,null,"No","Last year of crash data:",null,null,2007,null,"Number","Lanes","Study Period",{"$f":"IF(Main!$AC$14=TRUE, \"Crash Period Description\", \"Study Period Description\")","v":"Crash Period Description"},null,null,null,{"$f":"IF(Main!$AC$14=TRUE, \"Study Period Description\", \"\")","v":"Study Period Description"}]
[null,"Ramp segments",null,"Segment crash data available?",null,null,null,"Yes","First year of crash data:",null,null,2005,null,null,null,"Length (mi)"]
[null,null,null,"Project-level crash data available?",null,null,null,"No","Last year of crash data:",null,null,2007,null,1,{"$f":" 'Input Freeway Segments'!$G$8","v":5},{"$f":"IF(Main!$AC$14=FALSE, 'Input Freeway Segments'!$G$10, 'Input Freeway Segments'!$H$10)","v":0.09},{"$f":" 'Input Freeway Segments'!$G$9","v":"Station 0+00.00 "},null,null,null,{"$f":"IF(Main!$AC$14=TRUE,  'Input Freeway Segments'!$H$9,\"\")","v":0}]
[null,"Ramp terminals",null,"Segment crash data available?",null,null,null,"Yes","First year of crash data:",null,null,2005,null,{"$f":"N13+1","v":2},{"$f":" 'Input Freeway Segments'!$I$8","v":5},{"$f":"IF(Main!$AC$14=FALSE, 'Input Freeway Segments'!$I$10, 'Input Freeway Segments'!$J$10)","v":0.05},{"$f":" 'Input Freeway Segments'!$I$9","v":"Station 4+75.20"},null,null,null,{"$f":"IF(Main!$AC$14=TRUE,  'Input Freeway Segments'!$J$9, \"\")","v":0}]
[null,null,null,"Project-level crash data available?",null,null,null,"No","Last year of crash data:",null,null,2007,null,{"$f":"N14+1","v":3},{"$f":" 'Input Freeway Segments'!$K$8","v":4},{"$f":"IF(Main!$AC$14=FALSE, 'Input Freeway Segments'!$K$10, 'Input Freeway Segments'!$L$10)","v":0.08},{"$f":" 'Input Freeway Segments'!$K$9","v":0},null,null,null,{"$f":"IF(Main!$AC$14=TRUE,  'Input Freeway Segments'!$L$9, \"\")","v":"Alt seg"}]
[null,"Estimated Crash Statistics",null,null,null,null,null,null,null,null,null,null,null,4,{"$f":" 'Input Freeway Segments'!$M$8","v":4},{"$f":"IF(Main!$AC$14=FALSE, 'Input Freeway Segments'!$M$10, 'Input Freeway Segments'!$N$10)","v":0.25},{"$f":" 'Input Freeway Segments'!$M$9","v":0},null,null,null,{"$f":"IF(Main!$AC$14=TRUE, 'Input Freeway Segments'!$N$9, \"\")","v":0}]
[null,"Crashes for Entire Facility",null,null,null,null,"Total","K","A","B","C","PDO",null,5,{"$f":" 'Input Freeway Segments'!$O$8","v":0},{"$f":"IF(Main!$AC$14=FALSE, 'Input Freeway Segments'!$O$10, 'Input Freeway Segments'!$P$10)","v":0},{"$f":" 'Input Freeway Segments'!$O$9","v":0},null,null,null,{"$f":"IF(Main!$AC$14=TRUE,  'Input Freeway Segments'!$P$9, \"\")","v":0}]
[null,"Estimated number of crashes during Study Period, crashes:",null,null,null,null,120.46385192871094,0.26010811328887939,1.6626038551330566,10.864396095275879,40.290752410888672,67.385993957519531,null,6,{"$f":" 'Input Freeway Segments'!$Q$8","v":0},{"$f":"IF(Main!$AC$14=FALSE, 'Input Freeway Segments'!$Q$10, 'Input Freeway Segments'!$R$10)","v":0},{"$f":" 'Input Freeway Segments'!$Q$9","v":0},null,null,null,{"$f":"IF(Main!$AC$14=TRUE,  'Input Freeway Segments'!$R$9, \"\")","v":0}]
[null,"Estimated average crash freq. during Study Period, crashes/yr:",null,null,null,null,40.154617309570313,8.6702696979045868E-2,0.55420124530792236,3.6214654445648193,13.43025016784668,22.461997985839844,null,7,{"$f":" 'Input Freeway Segments'!$S$8","v":0},{"$f":"IF(Main!$AC$14=FALSE, 'Input Freeway Segments'!$S$10, 'Input Freeway Segments'!$T$10)","v":0},{"$f":" 'Input Freeway Segments'!$S$9","v":0},null,null,null,{"$f":"IF(Main!$AC$14=TRUE,  'Input Freeway Segments'!$T$9, \"\")","v":0}]
[null,"Crashes by Facility Component",null,null,null,"Nbr. Sites","Total","K","A","B","C","PDO",null,8,{"$f":" 'Input Freeway Segments'!$U$8","v":0},{"$f":"IF(Main!$AC$14=FALSE, 'Input Freeway Segments'!$U$10, 'Input Freeway Segments'!$V$10)","v":0},{"$f":" 'Input Freeway Segments'!$U$9","v":0},null,null,null,{"$f":"IF(Main!$AC$14=TRUE,  'Input Freeway Segments'!$V$9, \"\")","v":0}]
[null,"Freeway segments, crashes:",null,null,null,4,24.463985443115234,0.14042666554450989,0.35275736451148987,2.1692416667938232,4.267392635345459,17.53416633605957,null,9,{"$f":"'Input Freeway Segments'!$W$8","v":0},{"$f":"IF(Main!$AC$14=FALSE, 'Input Freeway Segments'!$W$10, 'Input Freeway Segments'!$X$10)","v":0},{"$f":" 'Input Freeway Segments'!$W$9","v":0},null,null,null,{"$f":"IF(Main!$AC$14=TRUE,  'Input Freeway Segments'!$X$9, \"\")","v":0}]
[null,"Ramp segments, crashes:",null,null,null,6,4.913271427154541,4.4148549437522888E-2,0.13386979699134827,0.66558760404586792,1.0972113609313965,2.9724540710449219,null,10,{"$f":"'Input Freeway Segments'!$Y$8","v":0},{"$f":"IF(Main!$AC$14=FALSE, 'Input Freeway Segments'!$Y$10, 'Input Freeway Segments'!$Z$10)","v":0},{"$f":"'Input Freeway Segments'!$Y$9","v":0},null,null,null,{"$f":"IF(Main!$AC$14=TRUE,  'Input Freeway Segments'!$Z$9, \"\")","v":0}]
[null,"Crossroad ramp terminals, crashes:",null,null,null,6,91.086593627929688,7.5532883405685425E-2,1.1759766340255737,8.029566764831543,34.9261474609375,46.879375457763672,null,11,{"$f":" 'Input Freeway Segments'!$AA$8","v":0},{"$f":"IF(Main!$AC$14=FALSE, 'Input Freeway Segments'!$AA$10, 'Input Freeway Segments'!$AB$10)","v":0},{"$f":" 'Input Freeway Segments'!$AA$9","v":0},null,null,null,{"$f":"IF(Main!$AC$14=TRUE,  'Input Freeway Segments'!$AB$9, \"\")","v":0}]
[null,"Crashes for Entire Facility by Year",null,null,null,"Year","Total","K","A","B","C","PDO",null,12,{"$f":" 'Input Freeway Segments'!$AC$8","v":0},{"$f":"IF(Main!$AC$14=FALSE, 'Input Freeway Segments'!$AC$10, 'Input Freeway Segments'!$AD$10)","v":0},{"$f":" 'Input Freeway Segments'!$AC$9","v":0},null,null,null,{"$f":"IF(Main!$AC$14=TRUE,  'Input Freeway Segments'!$AD$9, \"\")","v":0}]
[null,"Estimated number of crashes during",null,null,null,{"$f":"Main!D7","v":2013},40.122821807861328,8.6601167917251587E-2,0.55360668897628784,3.6178486347198486,13.417720794677734,22.447042465209961,null,13,{"$f":" 'Input Freeway Segments'!$AE$8","v":0},{"$f":"IF(Main!$AC$14=FALSE, 'Input Freeway Segments'!$AE$10, 'Input Freeway Segments'!$AF$10)","v":0},{"$f":" 'Input Freeway Segments'!$AE$9","v":0},null,null,null,{"$f":"IF(Main!$AC$14=TRUE,  'Input Freeway Segments'!$AF$9, \"\")","v":0}]
[null,"the Study Period, crashes:",null,null,null,{"$f":"F25+1","v":2014},40.170516967773438,8.6753465235233307E-2,0.55449855327606201,3.6232740879058838,13.436515808105469,22.469476699829102,null,14,{"$f":" 'Input Freeway Segments'!$AG$8","v":0},{"$f":"IF(Main!$AC$14=FALSE, 'Input Freeway Segments'!$AG$10, 'Input Freeway Segments'!$AH$10)","v":0},{"$f":" 'Input Freeway Segments'!$AG$9","v":0},null,null,null,{"$f":"IF(Main!$AC$14=TRUE,  'Input Freeway Segments'!$AH$9, \"\")","v":0}]
[null,null,null,null,null,{"$f":"F26+1","v":2015},40.170516967773438,8.6753465235233307E-2,0.55449855327606201,3.6232740879058838,13.436515808105469,22.469476699829102,null,15,{"$f":" 'Input Freeway Segments'!$AI$8","v":0},{"$f":"IF(Main!$AC$14=FALSE, 'Input Freeway Segments'!$AI$10, 'Input Freeway Segments'!$AJ$10)","v":0},{"$f":"'Input Freeway Segments'!$AI$9","v":0},null,null,null,{"$f":"IF(Main!$AC$14=TRUE, 'Input Freeway Segments'!$AJ$9, \"\")","v":0}]
[null,null,null,null,null,2016,null,null,null,null,null,null,null,16,{"$f":" 'Input Freeway Segments'!$AK$8","v":0},{"$f":"IF(Main!$AC$14=FALSE, 'Input Freeway Segments'!$AK$10, 'Input Freeway Segments'!$AL$10)","v":0},{"$f":" 'Input Freeway Segments'!$AK$9","v":0},null,null,null,{"$f":"IF(Main!$AC$14=TRUE,  'Input Freeway Segments'!$AL$9, \"\")","v":0}]
[null,null,null,null,null,2017,null,null,null,null,null,null,null,17,{"$f":"'Input Freeway Segments'!$AM$8","v":0},{"$f":"IF(Main!$AC$14=FALSE, 'Input Freeway Segments'!$AM$10, 'Input Freeway Segments'!$AN$10)","v":0},{"$f":" 'Input Freeway Segments'!$AM$9","v":0},null,null,null,{"$f":"IF(Main!$AC$14=TRUE,  'Input Freeway Segments'!$AN$9, \"\")","v":0}]
[null,"Total Present Value:",null,9784651.3263444155,null,2018,null,null,null,null,null,null,null,18,{"$f":" 'Input Freeway Segments'!$AO$8","v":0},{"$f":"IF(Main!$AC$14=FALSE, 'Input Freeway Segments'!$AO$10, 'Input Freeway Segments'!$AP$10)","v":0},{"$f":" 'Input Freeway Segments'!$AO$9","v":0},null,null,null,{"$f":"IF(Main!$AC$14=TRUE,  'Input Freeway Segments'!$AP$9, \"\")","v":0}]
[null,null,null,null,null,2019,null,null,null,null,null,null,null,19,{"$f":" 'Input Freeway Segments'!$AQ$8","v":0},{"$f":"IF(Main!$AC$14=FALSE, 'Input Freeway Segments'!$AQ$10, 'Input Freeway Segments'!$AR$10)","v":0},{"$f":" 'Input Freeway Segments'!$AQ$9","v":0},null,null,null,{"$f":"IF(Main!$AC$14=TRUE,  'Input Freeway Segments'!$AR$9, \"\")","v":0}]
[null,null,null,null,null,2020,null,null,null,null,null,null,null,20,{"$f":" 'Input Freeway Segments'!$AS$8","v":0},{"$f":"IF(Main!$AC$14=FALSE, 'Input Freeway Segments'!$AS$10, 'Input Freeway Segments'!$AT$10)","v":0},{"$f":" 'Input Freeway Segments'!$AS$9","v":0},null,null,null,{"$f":"IF(Main!$AC$14=TRUE,  'Input Freeway Segments'!$AT$9, \"\")","v":0}]
[null,null,null,null,null,2021,null,null,null,null,null,null,null,"Ramp Segments"]
[null,null,null,null,null,2022,null,null,null,null,null,null,null,"Number",{"$f":"IF(Main!$AG$14=TRUE, \"Crash Period\", \"Study Period\")","v":"Crash Period"},null,{"$f":"IF(Main!$AG$14=TRUE, \"Study Period\", \"\")","v":"Study Period"},null,"Number",{"$f":"IF(Main!$AG$14=TRUE, \"Crash Period\", \"Study Period\")","v":"Crash Period"},null,{"$f":"IF(Main!$AG$14=TRUE, \"Study Period\", \"\")","v":"Study Period"}]
[null,null,null,null,null,2023,null,null,null,null,null,null,null,null,"Description",null,{"$f":"IF(Main!$AG$14=TRUE, \"Description\", \"\")","v":"Description"},null,null,"Description",null,{"$f":"IF(Main!$AG$14=TRUE, \"Description\", \"\")","v":"Description"}]
[null,null,null,null,null,2024,null,null,null,null,null,null,null,1,{"$f":" 'Input Ramp Segments'!$G$9","v":"NB exit at Main"},null,{"$f":"IF(Main!$AG$14=TRUE,'Input Ramp Segments'!$H$9,\"\")","v":0},null,21,{"$f":" 'Input Ramp Segments'!$AU$9","v":0},null,{"$f":"IF(Main!$AG$14=TRUE,  'Input Ramp Segments'!$AV$9, \"\")","v":0}]
[null,null,null,null,null,2025,null,null,null,null,null,null,null,{"$f":"N36+1","v":2},{"$f":" 'Input Ramp Segments'!$I$9","v":"SB Exit at Main"},null,{"$f":"IF(Main!$AG$14=TRUE,  'Input Ramp Segments'!$J$9,\"\")","v":0},null,{"$f":"S36+1","v":22},{"$f":"'Input Ramp Segments'!$AW$9","v":0},null,{"$f":"IF(Main!$AG$14=TRUE,  'Input Ramp Segments'!$AX$9, \"\")","v":0}]
[null,null,null,null,null,2026,null,null,null,null,null,null,null,{"$f":"N37+1","v":3},{"$f":" 'Input Ramp Segments'!$K$9","v":0},null,{"$f":"IF(Main!$AG$14=TRUE,  'Input Ramp Segments'!$L$9,\"\")","v":"alt 3"},null,{"$f":"S37+1","v":23},{"$f":"'Input Ramp Segments'!$AY$9","v":0},null,{"$f":"IF(Main!$AG$14=TRUE, 'Input Ramp Segments'!$AZ$9, \"\")","v":0}]
[null,null,null,null,null,2027,null,null,null,null,null,null,null,4,{"$f":" 'Input Ramp Segments'!$M$9","v":0},null,{"$f":"IF(Main!$AG$14=TRUE,  'Input Ramp Segments'!$N$9,\"\")","v":0},null,24,{"$f":" 'Input Ramp Segments'!$BA$9","v":0},null,{"$f":"IF(Main!$AG$14=TRUE,  'Input Ramp Segments'!$BB$9, \"\")","v":0}]
[null,null,null,null,null,2028,null,null,null,null,null,null,null,5,{"$f":" 'Input Ramp Segments'!$O$9","v":0},null,{"$f":"IF(Main!$AG$14=TRUE, 'Input Ramp Segments'!$P$9,\"\")","v":0},null,25,{"$f":" 'Input Ramp Segments'!$BC$9","v":0},null,{"$f":"IF(Main!$AG$14=TRUE, 'Input Ramp Segments'!$BD$9, \"\")","v":0}]
[null,null,null,null,null,2029,null,null,null,null,null,null,null,6,{"$f":" 'Input Ramp Segments'!$Q$9","v":0},null,{"$f":"IF(Main!$AG$14=TRUE,  'Input Ramp Segments'!$R$9, \"\")","v":0},null,26,{"$f":" 'Input Ramp Segments'!$BE$9","v":0},null,{"$f":"IF(Main!$AG$14=TRUE,  'Input Ramp Segments'!$BF$9, \"\")","v":0}]
[null,null,null,null,null,2030,null,null,null,null,null,null,null,7,{"$f":" 'Input Ramp Segments'!$S$9","v":0},null,{"$f":"IF(Main!$AG$14=TRUE,  'Input Ramp Segments'!$T$9, \"\")","v":0},null,27,{"$f":" 'Input Ramp Segments'!$BG$9","v":0},null,{"$f":"IF(Main!$AG$14=TRUE,  'Input Ramp Segments'!$BH$9, \"\")","v":0}]
[null,null,null,null,null,2031,null,null,null,null,null,null,null,8,{"$f":" 'Input Ramp Segments'!$U$9","v":0},null,{"$f":"IF(Main!$AG$14=TRUE,  'Input Ramp Segments'!$V$9, \"\")","v":0},null,28,{"$f":" 'Input Ramp Segments'!$BI$9","v":0},null,{"$f":"IF(Main!$AG$14=TRUE, 'Input Ramp Segments'!$BJ$9, \"\")","v":0}]
[null,null,null,null,null,2032,null,null,null,null,null,null,null,9,{"$f":" 'Input Ramp Segments'!$W$9","v":0},null,{"$f":"IF(Main!$AG$14=TRUE,  'Input Ramp Segments'!$X$9, \"\")","v":0},null,29,{"$f":" 'Input Ramp Segments'!$BK$9","v":0},null,{"$f":"IF(Main!$AG$14=TRUE,  'Input Ramp Segments'!$BL$9, \"\")","v":0}]
[null,null,null,null,null,2033,null,null,null,null,null,null,null,10,{"$f":"'Input Ramp Segments'!$Y$9","v":0},null,{"$f":"IF(Main!$AG$14=TRUE,  'Input Ramp Segments'!$Z$9, \"\")","v":0},null,30,{"$f":" 'Input Ramp Segments'!$BM$9","v":0},null,{"$f":"IF(Main!$AG$14=TRUE,  'Input Ramp Segments'!$BN$9, \"\")","v":0}]
[null,null,null,null,null,2034,null,null,null,null,null,null,null,11,{"$f":" 'Input Ramp Segments'!$AA$9","v":0},null,{"$f":"IF(Main!$AG$14=TRUE,  'Input Ramp Segments'!$AB$9, \"\")","v":0},null,31,{"$f":" 'Input Ramp Segments'!$BO$9","v":0},null,{"$f":"IF(Main!$AG$14=TRUE,  'Input Ramp Segments'!$BP$9, \"\")","v":0}]
[null,null,null,null,null,2035,null,null,null,null,null,null,null,12,{"$f":" 'Input Ramp Segments'!$AC$9","v":0},null,{"$f":"IF(Main!$AG$14=TRUE,  'Input Ramp Segments'!$AD$9, \"\")","v":0},null,32,{"$f":"'Input Ramp Segments'!$BQ$9","v":0},null,{"$f":"IF(Main!$AG$14=TRUE,  'Input Ramp Segments'!$BR$9, \"\")","v":0}]
[null,null,null,null,null,2036,null,null,null,null,null,null,null,13,{"$f":" 'Input Ramp Segments'!$AE$9","v":0},null,{"$f":"IF(Main!$AG$14=TRUE,  'Input Ramp Segments'!$AF$9, \"\")","v":0},null,33,{"$f":" 'Input Ramp Segments'!$BS$9","v":0},null,{"$f":"IF(Main!$AG$14=TRUE, 'Input Ramp Segments'!$BT$9, \"\")","v":0}]
[null,"Distribution of Crashes for Entire Facility",null,null,null,null,null,null,null,null,null,null,null,14,{"$f":"'Input Ramp Segments'!$AG$9","v":0},null,{"$f":"IF(Main!$AG$14=TRUE,  'Input Ramp Segments'!$AH$9, \"\")","v":0},null,34,{"$f":" 'Input Ramp Segments'!$BU$9","v":0},null,{"$f":"IF(Main!$AG$14=TRUE,  'Input Ramp Segments'!$BV$9, \"\")","v":0}]
[null,"Crash Type",null,"Crash Type Category",null,null,"Estimated Number of Crashes During the Study Period",null,null,null,null,null,null,15,{"$f":" 'Input Ramp Segments'!$AI$9","v":0},null,{"$f":"IF(Main!$AG$14=TRUE,  'Input Ramp Segments'!$AJ$9, \"\")","v":0},null,35,{"$f":" 'Input Ramp Segments'!$BW$9","v":0},null,{"$f":"IF(Main!$AG$14=TRUE, 'Input Ramp Segments'!$BX$9, \"\")","v":0}]
[null,null,null,null,null,null,"Total","K","A","B","C","PDO",null,16,{"$f":"'Input Ramp Segments'!$AK$9","v":0},null,{"$f":"IF(Main!$AG$14=TRUE,  'Input Ramp Segments'!$AL$9, \"\")","v":0},null,36,{"$f":" 'Input Ramp Segments'!$BY$9","v":0},null,{"$f":"IF(Main!$AG$14=TRUE,  'Input Ramp Segments'!$BZ$9, \"\")","v":0}]
[null,"Multiple vehicle",null,"Head-on crashes:",null,null,0.93278706073760986,1.6946843825280666E-3,1.5666274353861809E-2,0.10526169091463089,0.43184170126914978,0.37832263112068176,null,17,{"$f":" 'Input Ramp Segments'!$AM$9","v":0},null,{"$f":"IF(Main!$AG$14=TRUE,  'Input Ramp Segments'!$AN$9, \"\")","v":0},null,37,{"$f":" 'Input Ramp Segments'!$CA$9","v":0},null,{"$f":"IF(Main!$AG$14=TRUE, 'Input Ramp Segments'!$CB$9, \"\")","v":0}]
[null,null,null,"Right-angle crashes:",null,null,24.479555130004883,2.8536135330796242E-2,0.34631800651550293,2.3479278087615967,10.134658813476563,11.622116088867188,null,18,{"$f":" 'Input Ramp Segments'!$AO$9","v":0},null,{"$f":"IF(Main!$AG$14=TRUE,  'Input Ramp Segments'!$AP$9, \"\")","v":0},null,38,{"$f":" 'Input Ramp Segments'!$CC$9","v":0},null,{"$f":"IF(Main!$AG$14=TRUE,  'Input Ramp Segments'!$CD$9, \"\")","v":0}]
[null,null,null,"Rear-end crashes:",null,null,62.093509674072266,9.9017873406410217E-2,0.84321653842926025,5.6676015853881836,22.379199981689453,33.104473114013672,null,19,{"$f":" 'Input Ramp Segments'!$AQ$9","v":0},null,{"$f":"IF(Main!$AG$14=TRUE,  'Input Ramp Segments'!$AR$9, \"\")","v":0},null,39,{"$f":"'Input Ramp Segments'!$CE$9","v":0},null,{"$f":"IF(Main!$AG$14=TRUE,  'Input Ramp Segments'!$CF$9, \"\")","v":0}]
[null,null,null,"Sideswipe crashes:",null,null,12.399249076843262,1.6846871003508568E-2,8.1970632076263428E-2,0.5367656946182251,1.799220085144043,9.9644460678100586,null,20,{"$f":" 'Input Ramp Segments'!$AS$9","v":0},null,{"$f":"IF(Main!$AG$14=TRUE,  'Input Ramp Segments'!$AT$9, \"\")","v":0},null,40,{"$f":" 'Input Ramp Segments'!$CG$9","v":0},null,{"$f":"IF(Main!$AG$14=TRUE, 'Input Ramp Segments'!$CH$9, \"\")","v":0}]
[null,null,null,"Other multiple-vehicle crashes:",null,null,1.8348664045333862,4.1482080705463886E-3,2.0517274737358093E-2,0.13219892978668213,0.44566637277603149,1.2323355674743652,null,"Crossroad Ramp Terminals"]
[null,null,null,"   Total multiple-vehicle crashes:",null,null,101.73996734619141,0.15024377405643463,1.3076885938644409,8.7897567749023438,35.190589904785156,56.301692962646484,null,"Number","Config.","Control",{"$f":"IF(Main!$AK$14=TRUE, \"Crash Period Description\", \"Study Period Description\")","v":"Crash Period Description"},null,null,null,{"$f":"IF(Main!$AK$14=TRUE, \"Study Period Description\", \"\")","v":"Study Period Description"}]
[null,"Single vehicle",null,"Crashes with animal:",null,null,0.13888458907604218,3.6378047661855817E-4,9.8819611594080925E-4,5.5735688656568527E-3,1.0465736500918865E-2,0.12149330973625183]
[null,null,null,"Crashes with fixed object:",null,null,13.898609161376953,7.8994832932949066E-2,0.25089937448501587,1.461702823638916,3.5323445796966553,8.5746669769287109,null,1,{"$f":"'Input Ramp Terminals'!$G$8","v":"D4"},{"$f":"'Input Ramp Terminals'!$G$10","v":"Signal"},{"$f":" 'Input Ramp Terminals'!$G$9","v":"NB exit ramp at Main"},null,null,null,{"$f":"IF(Main!$AK$14=TRUE,  'Input Ramp Terminals'!$H$9, \"\")","v":0}]
[null,null,null,"Crashes with other object:",null,null,1.140254020690918,4.0586781688034534E-3,1.1439339257776737E-2,6.8632684648036957E-2,0.14874562621116638,0.90737777948379517,null,{"$f":"N59+1","v":2},{"$f":"'Input Ramp Terminals'!$I$8","v":"A2"},{"$f":"'Input Ramp Terminals'!$I$10","v":"One stop"},{"$f":" 'Input Ramp Terminals'!$I$9","v":"SB exit ramp at Main"},null,null,null,{"$f":"IF(Main!$AK$14=TRUE,  'Input Ramp Terminals'!$J$9, \"\")","v":0}]
[null,null,null,"Crashes with parked vehicle:",null,null,0.34377795457839966,1.4624561881646514E-3,4.835350438952446E-3,2.8551394119858742E-2,7.0394739508628845E-2,0.23853400349617004,null,{"$f":"N60+1","v":3},{"$f":"'Input Ramp Terminals'!$K$8","v":"D3ex"},{"$f":"'Input Ramp Terminals'!$K$10","v":"One stop"},{"$f":" 'Input Ramp Terminals'!$K$9","v":0},null,null,null,{"$f":"IF(Main!$AK$14=TRUE,  'Input Ramp Terminals'!$L$9, \"\")","v":"Alt 1"}]
[null,null,null,"Other single-vehicle crashes",null,null,3.2023537158966064,2.4984575808048248E-2,8.6752608418464661E-2,0.51017999649047852,1.3382111787796021,1.2422252893447876,null,{"$f":"N61+1","v":4},{"$f":"'Input Ramp Terminals'!$M$8","v":"D4"},{"$f":"'Input Ramp Terminals'!$M$10","v":"All stop"},{"$f":"'Input Ramp Terminals'!$M$9","v":0},null,null,null,{"$f":"IF(Main!$AK$14=TRUE,  'Input Ramp Terminals'!$N$9,\"\")","v":0}]
[null,null,null,"   Total single-vehicle crashes:",null,null,18.723878860473633,0.10986433178186417,0.35491484403610229,2.0746405124664307,5.1001620292663574,11.084298133850098,null,{"$f":"N62+1","v":5},{"$f":"'Input Ramp Terminals'!$O$8","v":"B4"},{"$f":"'Input Ramp Terminals'!$O$10","v":"One stop"},{"$f":" 'Input Ramp Terminals'!$O$9","v":0},null,null,null,{"$f":"IF(Main!$AK$14=TRUE,  'Input Ramp Terminals'!$P$9, \"\")","v":0}]
[null,null,null,null,"Total crashes:",null,120.46385192871094,0.26010811328887939,1.6626038551330566,10.864396095275879,40.290752410888672,67.385993957519531,null,{"$f":"N63+1","v":6},{"$f":"'Input Ramp Terminals'!$Q$8","v":"A4"},{"$f":"'Input Ramp Terminals'!$Q$10","v":"Signal"},{"$f":" 'Input Ramp Terminals'!$Q$9","v":0},null,null,null,{"$f":"IF(Main!$AK$14=TRUE,  'Input Ramp Terminals'!$R$9, \"\")","v":0}]

{"sheet":"Output Freeway Segments","index":7,"n_rows":584,"n_cols":46,"rows_kept":584,"cut":false,"hidden":false,"merged":[[446,4,446,5],[440,4,440,5],[441,4,441,5],[442,4,442,5],[443,4,443,5],[444,4,444,5],[445,4,445,5],[4,45,5,45],[4,41,5,41],[4,42,5,42],[4,43,5,43],[4,44,5,44],[438,4,439,5],[4,25,5,25],[4,26,5,26],[4,27,5,27],[4,28,5,28],[4,17,5,17],[4,18,5,18],[4,19,5,19],[4,20,5,20],[4,21,5,21],[4,22,5,22],[4,11,5,11],[4,12,5,12],[4,13,5,13],[4,14,5,14],[4,15,5,15],[4,31,5,31],[4,32,5,32],[4,29,5,29],[4,30,5,30],[4,23,5,23],[4,24,5,24],[4,39,5,39],[4,40,5,40],[4,33,5,33],[4,34,5,34],[4,35,5,35],[4,36,5,36],[4,37,5,37],[4,38,5,38],[4,16,5,16],[4,6,5,6],[4,7,5,7],[4,8,5,8],[5,2,5,5],[4,9,5,9],[4,10,5,10]]}
[]
[]
[null,null,null,null,"Output Worksheet for Freeway Segments"]
[null,"    MV = multiple-vehicle model","ENR = ramp entrance model",null,null,null,{"$f":"\"Segment \"& TEXT(INT((COLUMN()-5)/2),\"0\")","v":"Segment 1"},null,{"$f":"\"Segment \"& TEXT(INT((COLUMN()-5)/2),\"0\")","v":"Segment 2"},null,{"$f":"\"Segment \"& TEXT(INT((COLUMN()-5)/2),\"0\")","v":"Segment 3"},null,{"$f":"\"Segment \"& TEXT(INT((COLUMN()-5)/2),\"0\")","v":"Segment 4"},null,{"$f":"\"Segment \"& TEXT(INT((COLUMN()-5)/2),\"0\")","v":"Segment 5"},null,{"$f":"\"Segment \"& TEXT(INT((COLUMN()-5)/2),\"0\")","v":"Segment 6"},null,{"$f":"\"Segment \"& TEXT(INT((COLUMN()-5)/2),\"0\")","v":"Segment 7"},null,{"$f":"\"Segment \"& TEXT(INT((COLUMN()-5)/2),\"0\")","v":"Segment 8"},null,{"$f":"\"Segment \"& TEXT(INT((COLUMN()-5)/2),\"0\")","v":"Segment 9"},null,{"$f":"\"Segment \"& TEXT(INT((COLUMN()-5)/2),\"0\")","v":"Segment 10"},null,{"$f":"\"Segment \"& TEXT(INT((COLUMN()-5)/2),\"0\")","v":"Segment 11"},null,{"$f":"\"Segment \"& TEXT(INT((COLUMN()-5)/2),\"0\")","v":"Segment 12"},null,{"$f":"\"Segment \"& TEXT(INT((COLUMN()-5)/2),\"0\")","v":"Segment 13"},null,{"$f":"\"Segment \"& TEXT(INT((COLUMN()-5)/2),\"0\")","v":"Segment 14"},null,{"$f":"\"Segment \"& TEXT(INT((COLUMN()-5)/2),\"0\")","v":"Segment 15"},null,{"$f":"\"Segment \"& TEXT(INT((COLUMN()-5)/2),\"0\")","v":"Segment 16"},null,{"$f":"\"Segment \"& TEXT(INT((COLUMN()-5)/2),\"0\")","v":"Segment 17"},null,{"$f":"\"Segment \"& TEXT(INT((COLUMN()-5)/2),\"0\")","v":"Segment 18"},null,{"$f":"\"Segment \"& TEXT(INT((COLUMN()-5)/2),\"0\")","v":"Segment 19"},null,{"$f":"\"Segment \"& TEXT(INT((COLUMN()-5)/2),\"0\")","v":"Segment 20"}]
[null,"    SV = single-vehicle model","EXR = ramp exit model",null,null,null,{"$f":"IF(Main!$AC$14=TRUE, \"Crash Period\", \"Study Period\")","v":"Crash Period"},{"$f":"IF(Main!$AC$14=TRUE, \"Study Period\", \"\")","v":"Study Period"},{"$f":"G5","v":"Crash Period"},"Study Period","Crash Period","Study Period","Crash Period","Study Period","Crash Period","Study Period","Crash Period","Study Period","Crash Period","Study Period","Crash Period","Study Period","Crash Period","Study Period","Crash Period","Study Period","Crash Period","Study Period","Crash Period","Study Period","Crash Period","Study Period","Crash Period","Study Period","Crash Period","Study Period","Crash Period","Study Period","Crash Period","Study Period","Crash Period","Study Period","Crash Period","Study Period","Crash Period","Study Period"]
[null,null,"Applicable Models (y)"]
[null,"Crash Modification Factors"]
[null,"Fatal-and-Injury Crash CMFs"]
[null,"Horizontal curve (CMF1,w,ac,y,fi):","MV",null,"ENR","EXR",1,1,1,1,1,1,1.0432188510894775,1.0432188510894775]
[null,null,null,"SV",null,null,1,1,1,1,1,1,1.1806646585464478,1.1806646585464478]
[null,"Lane width (CMF2,w,ac,y,fi):","MV","SV","ENR","EXR",1.0461534261703491,1,1.0461534261703491,1.0461534261703491,1,1,1,1]
[null,"Outside shoulder width (CMF8,fs,ac,sv,fi):",null,"SV",null,null,1.4743245840072632,1.4743245840072632,1.3819561004638672,1.3819561004638672,1.0668389797210693,1.0668389797210693,1,1]
[null,"Inside shoulder width (CMF3,w,ac,y,fi):","MV","SV","ENR","EXR",1.0620489120483398,1.0620489120483398,1.0620489120483398,1.0620489120483398,0.94970870018005371,0.94970870018005371,0.94970870018005371,0.94970870018005371]
[null,"Median width (CMF4,w,ac,y,fi):","MV",null,"ENR","EXR",1.150768518447876,1.150768518447876,1.150768518447876,1.150768518447876,1.150768518447876,1.150768518447876,1.150768518447876,1.150768518447876]
[null,null,null,"SV",null,null,0.95367723703384399,0.95367723703384399,0.95367723703384399,0.95367723703384399,0.95367723703384399,0.95367723703384399,0.95367723703384399,0.95367723703384399]
[null,"Median barrier (CMF5,w,ac,y,fi):","MV","SV","ENR","EXR",1.1908491849899292,1.1908491849899292,1.1908491849899292,1.1908491849899292,1.1908491849899292,1.1908491849899292,1.1908491849899292,1.1908491849899292]
[null,"Shoulder rumble strip (CMF9,fs,ac,sv,fi):",null,"SV",null,null,1,1,1,1,0.81139522790908813,0.81139522790908813,0.93587440252304077,0.93587440252304077]
[null,"Outside clearance (CMF10,fs,ac,sv,fi):",null,"SV",null,null,1.0309876203536987,1.0309876203536987,0.98814445734024048,0.98814445734024048,1.0943931341171265,1.0943931341171265,1,1]
[null,"Outside barrier (CMF11,fs,ac,sv,fi):",null,"SV",null,null,1.0107594728469849,1.0107594728469849,1.0053796768188477,1.0053796768188477,1,1,1,1]
[null,"Lane change (CMF7,fs,ac,mv,fi):","MV"]
[null,null,null,null,"Year:",{"$f":"Main!AC5","v":2005},1,1,1.3910934925079346,1.3910934925079346,1.468920111656189,1.468920111656189,1.0143992900848389,1.0143992900848389]
[null,null,null,null,null,{"$f":"F21+1","v":2006},1,1,1.3910934925079346,1.3910934925079346,1.468920111656189,1.468920111656189,1.0143992900848389,1.0143992900848389]
[null,null,null,null,null,{"$f":"F22+1","v":2007},1,1,1.3910934925079346,1.3910934925079346,1.468920111656189,1.468920111656189,1.0143992900848389,1.0143992900848389]
[null,null,null,null,null,2008]
[null,null,null,null,null,2009]
[null,null,null,null,null,2010]
[null,null,null,null,null,2011]
[null,null,null,null,null,2012]
[null,null,null,null,null,2013,1,1,1.3910934925079346,1.3910934925079346,1.468920111656189,1.468920111656189,1.0143992900848389,1.0143992900848389]
[null,null,null,null,null,2014,1,1,1.3910934925079346,1.3910934925079346,1.468920111656189,1.468920111656189,1.0143992900848389,1.0143992900848389]
[null,null,null,null,null,2015,1,1,1.3910934925079346,1.3910934925079346,1.468920111656189,1.468920111656189,1.0143992900848389,1.0143992900848389]
[null,null,null,null,null,2016]
[null,null,null,null,null,2017]
[null,null,null,null,null,2018]
[null,null,null,null,null,2019]
[null,null,null,null,null,2020]
[null,null,null,null,null,2021]
[null,null,null,null,null,2022]
[null,null,null,null,null,2023]
[null,null,null,null,null,2024]
[null,null,null,null,null,2025]
[null,null,null,null,null,2026]
[null,null,null,null,null,2027]
[null,null,null,null,null,2028]
[null,"Ramp entrance (CMF12,sc,nEN,at,fi):",null,null,"ENR"]
[null,null,null,null,"Year:",{"$f":"F21","v":2005},1,1,2.4919109344482422,2.4919109344482422,1,1,1,1]
[null,null,null,null,null,{"$f":"F22","v":2006},1,1,2.4919109344482422,2.4919109344482422,1,1,1,1]
[null,null,null,null,null,2007,1,1,2.4919109344482422,2.4919109344482422,1,1,1,1]
[null,null,null,null,null,2008]
[null,null,null,null,null,2009]
[null,null,null,null,null,2010]
[null,null,null,null,null,2011]
[null,null,null,null,null,2012]
[null,null,null,null,null,2013,1,1,2.4919109344482422,2.4919109344482422,1,1,1,1]
[null,null,null,null,null,2014,1,1,2.4919109344482422,2.4919109344482422,1,1,1,1]
[null,null,null,null,null,2015,1,1,2.4919109344482422,2.4919109344482422,1,1,1,1]
[null,null,null,null,null,2016]
[null,null,null,null,null,2017]
[null,null,null,null,null,2018]
[null,null,null,null,null,2019]
[null,null,null,null,null,2020]
[null,null,null,null,null,2021]
[null,null,null,null,null,2022]
[null,null,null,null,null,2023]
[null,null,null,null,null,2024]
[null,null,null,null,null,2025]
[null,null,null,null,null,2026]
[null,null,null,null,null,2027]
[null,null,null,null,null,{"$f":"F44","v":2028}]
[null,"Ramp exit (CMF13,sc,nEX,at,fi):",null,null,null,"EXR",1,1,1.1802358627319336,1.1802358627319336,1,1,1,1]
[null,"High volume (CMF6,w,ac,y,fi):","MV",null,"ENR","EXR",1.1068298816680908,1.1068298816680908,1.0613057613372803,1.0613057613372803,1,1,1,1]
[null,null,null,"SV",null,null,0.98061531782150269,0.98061531782150269,0.98859059810638428,0.98859059810638428,1,1,1,1]
[null,"Property-Damage-Only Crash CMFs"]
[null,"Horizontal curve (CMF1,w,ac,y,pdo):","MV",null,"ENR","EXR",1,1,1,1,1,1,1.0854325294494629,1.0854325294494629]
[null,null,null,"SV",null,null,1,1,1,1,1,1,1.1572964191436768,1.1572964191436768]
[null,"Lane width (CMF2,w,ac,y,pdo):","MV","SV","ENR","EXR",1,1,1,1,1,1,1,1]
[null,"Outside shoulder width (CMF8,fs,ac,sv,pdo):",null,"SV",null,null,1,1,1,1,1,1,1,1]
[null,"Inside shoulder width (CMF3,w,ac,y,pdo):","MV","SV","ENR","EXR",1.0550097227096558,1.0550097227096558,1.0550097227096558,1.0550097227096558,0.95513749122619629,0.95513749122619629,0.95513749122619629,0.95513749122619629]
[null,"Median width (CMF4,w,ac,y,pdo):","MV",null,"ENR","EXR",1.1448973417282104,1.1448973417282104,1.1448973417282104,1.1448973417282104,1.1448973417282104,1.1448973417282104,1.1448973417282104,1.1448973417282104]
[null,null,null,"SV",null,null,1.1438331604003906,1.1438331604003906,1.1438331604003906,1.1438331604003906,1.1438331604003906,1.1438331604003906,1.1438331604003906,1.1438331604003906]
[null,"Median barrier (CMF5,w,ac,y,pdo):","MV","SV","ENR","EXR",1.2527402639389038,1.2527402639389038,1.2527402639389038,1.2527402639389038,1.2527402639389038,1.2527402639389038,1.2527402639389038,1.2527402639389038]
[null,"Shoulder rumble strip (CMF9,fs,ac,sv,pdo):",null,"SV",null,null,1,1,1,1,1,1,1,1]
[null,"Outside clearance (CMF10,fs,ac,sv,pdo):",null,"SV",null,null,1,1,1,1,1,1,1,1]
[null,"Outside barrier (CMF11,fs,ac,sv,pdo):",null,"SV",null,null,1.0139874219894409,1.0139874219894409,1.0069937705993652,1.0069937705993652,1,1,1,1]
[null,"Lane change (CMF7,fs,ac,mv,pdo):","MV"]
[null,null,null,null,"Year:",{"$f":"F21","v":2005},1,1,1.3735172748565674,1.3735172748565674,1.3182685375213623,1.3182685375213623,1.0093702077865601,1.0093702077865601]
[null,null,null,null,null,{"$f":"F86+1","v":2006},1,1,1.3735172748565674,1.3735172748565674,1.3182685375213623,1.3182685375213623,1.0093702077865601,1.0093702077865601]
[null,null,null,null,null,{"$f":"F87+1","v":2007},1,1,1.3735172748565674,1.3735172748565674,1.3182685375213623,1.3182685375213623,1.0093702077865601,1.0093702077865601]
[null,null,null,null,null,2008]
[null,null,null,null,null,2009]
[null,null,null,null,null,2010]
[null,null,null,null,null,2011]
[null,null,null,null,null,2012]
[null,null,null,null,null,2013,1,1,1.3735172748565674,1.3735172748565674,1.3182685375213623,1.3182685375213623,1.0093702077865601,1.0093702077865601]
[null,null,null,null,null,2014,1,1,1.3735172748565674,1.3735172748565674,1.3182685375213623,1.3182685375213623,1.0093702077865601,1.0093702077865601]
[null,null,null,null,null,2015,1,1,1.3735172748565674,1.3735172748565674,1.3182685375213623,1.3182685375213623,1.0093702077865601,1.0093702077865601]
[null,null,null,null,null,2016]
[null,null,null,null,null,2017]
[null,null,null,null,null,2018]
[null,null,null,null,null,2019]
[null,null,null,null,null,2020]
[null,null,null,null,null,2021]
[null,null,null,null,null,2022]
[null,null,null,null,null,2023]
[null,null,null,null,null,2024]
[null,null,null,null,null,2025]
[null,null,null,null,null,2026]
[null,null,null,null,null,2027]
[null,null,null,null,null,2028]
[null,"Ramp entrance (CMF12,sc,nEN,at,pdo):",null,null,"ENR",null,1,1,1.4333293437957764,1.4333293437957764,1,1,1,1]
[null,"Ramp exit (CMF13,sc,nEX,at,pdo):",null,null,null,"EXR",1,1,1,1,1,1,1,1]
[null,"High volume (CMF6,w,ac,y,pdo):","MV",null,"ENR","EXR",1.0855318307876587,1.0855318307876587,1.0492861270904541,1.0492861270904541,1,1,1,1]
[null,null,null,"SV",null,null,0.83762061595916748,0.83762061595916748,0.90134245157241821,0.90134245157241821,1,1,1,1]
[null,{"$f":"IF(Main!$AC$14=TRUE, \"Expected Average Crash Frequency\", \"Predicted Average Crash Frequency\")","v":"Expected Average Crash Frequency"}]
[null,"Fatal-and-Injury Crash Frequency"]
[null,"Freeway Segment Multiple-Vehicle Crash Analysis",null,null,null,"Year"]
[null,"Overdispersion parameter (kfs,n,mv,fi):",null,null,null,null,0.6313130259513855,null,3.1565656661987305,null,0.71022725105285645,null,0.22727271914482117]
[null,"Observed crash count (N*o,fs,n,mv,fi), crashes:",null,null,null,null,2,null,0,null,0,null,1]
[null,"Reference year (r):",null,null,null,null,2005,null,2005,null,2005,null,2005]
[null,"Predicted average crash freq. for reference year (Np,fs,n,mv,fi,r), crashes/yr:",null,null,null,null,0.46372678875923157,null,9.5323197543621063E-2,null,0.20305153727531433,null,0.31663966178894043]
[null,"Equivalent years associated with crash count (Cb,fs,n,mv,fi,r), yr:",null,null,null,null,3,null,3,null,3.130051851272583,null,3]
[null,"Expected average crash freq. for reference year given N*o (Ne,fs,n,mv,fi,r), crashes/yr:",null,null,null,null,0.55862051248550415,null,5.0099391490221024E-2,null,0.13990110158920288,null,0.31960374116897583]
[null,{"$f":"IF(Main!$AC$14=TRUE, \"Expected average crash frequency\", \"Predicted average crash frequency\")","v":"Expected average crash frequency"},null,null,null,{"$f":"Main!$AC$5","v":2005},0.55862051248550415,null,5.0099391490221024E-2,null,0.13990110158920288,null,0.31960374116897583]
[null,"  (Ne,fs,n,mv,fi), crashes/yr:","(Np,fs,n,mv,fi), crashes/yr:",null,null,{"$f":"F123+1","v":2006},0.55862051248550415,null,5.0099391490221024E-2,null,0.14593806862831116,null,0.31960374116897583]
[null,null,null,null,null,{"$f":"F124+1","v":2007},0.55862051248550415,null,5.0099391490221024E-2,null,0.15205854177474976,null,0.31960374116897583]
[null,null,null,null,null,2008]
[null,null,null,null,null,2009]
[null,null,null,null,null,2010]
[null,null,null,null,null,2011]
[null,null,null,null,null,2012]
[null,null,null,null,null,2013,null,0.53397566080093384,null,5.0099391490221024E-2,null,0.15205854177474976,null,0.31960374116897583]
[null,null,null,null,null,2014,null,0.53397566080093384,null,5.0099391490221024E-2,null,0.15205854177474976,null,0.31960374116897583]
[null,null,null,null,null,2015,null,0.53397566080093384,null,5.0099391490221024E-2,null,0.15205854177474976,null,0.31960374116897583]
[null,null,null,null,null,2016]
[null,null,null,null,null,2017]
[null,null,null,null,null,2018]
[null,null,null,null,null,2019]
[null,null,null,null,null,2020]
[null,null,null,null,null,2021]
[null,null,null,null,null,2022]
[null,null,null,null,null,2023]
[null,null,null,null,null,2024]
[null,null,null,null,null,2025]
[null,null,null,null,null,2026]
[null,null,null,null,null,2027]
[null,null,null,null,null,2028]
[null,"Freeway Segment Single-Vehicle Crash Analysis",null,null,null,"Year"]
[null,"Overdispersion parameter (kfs,n,sv,fi):",null,null,null,null,0.36913985013961792,null,1.8456995487213135,null,0.41528236865997314,null,0.13289034366607666]
[null,"Observed crash count (N*o,fs,n,sv,fi), crashes:",null,null,null,null,3,null,0,null,1,null,0]
[null,"Reference year (r):",null,null,null,null,2005,null,2005,null,2005,null,2005]
[null,"Predicted average crash freq. for reference year (Np,fs,n,sv,fi,r), crashes/yr:",null,null,null,null,0.37584382295608521,null,6.0490697622299194E-2,null,0.11780734360218048,null,0.36627903580665588]
[null,"Equivalent years associated with crash count (Cb,fs,n,sv,fi,r), yr:",null,null,null,null,3,null,3,null,3.0551984310150146,null,3]
[null,"Expected average crash freq. for reference year given N*o (Na,fs,n,sv,fi,r), crashes/yr:",null,null,null,null,0.55927920341491699,null,4.5313321053981781E-2,null,0.14504997432231903,null,0.31960827112197876]
[null,{"$f":"IF(Main!$AC$14=TRUE, \"Expected average crash frequency\", \"Predicted average crash frequency\")","v":"Expected average crash frequency"},null,null,null,{"$f":"F123","v":2005},0.55927920341491699,null,4.5313321053981781E-2,null,0.14504997432231903,null,0.31960827112197876]
[null,"  (Ne,fs,n,sv,fi), crashes/yr:","(Np,fs,n,sv,fi), crashes/yr:",null,null,{"$f":"F124","v":2006},0.55927920341491699,null,4.5313321053981781E-2,null,0.1477276086807251,null,0.31960827112197876]
[null,null,null,null,null,2007,0.55927920341491699,null,4.5313321053981781E-2,null,0.15037889778614044,null,0.31960827112197876]
[null,null,null,null,null,2008]
[null,null,null,null,null,2009]
[null,null,null,null,null,2010]
[null,null,null,null,null,2011]
[null,null,null,null,null,2012]
[null,null,null,null,null,2013,null,0.53460532426834106,null,4.5313321053981781E-2,null,0.15037889778614044,null,0.31960827112197876]
[null,null,null,null,null,2014,null,0.53460532426834106,null,4.5313321053981781E-2,null,0.15037889778614044,null,0.31960827112197876]
[null,null,null,null,null,2015,null,0.53460532426834106,null,4.5313321053981781E-2,null,0.15037889778614044,null,0.31960827112197876]
[null,null,null,null,null,2016]
[null,null,null,null,null,2017]
[null,null,null,null,null,2018]
[null,null,null,null,null,2019]
[null,null,null,null,null,2020]
[null,null,null,null,null,2021]
[null,null,null,null,null,2022]
[null,null,null,null,null,2023]
[null,null,null,null,null,2024]
[null,null,null,null,null,2025]
[null,null,null,null,null,2026]
[null,null,null,null,null,2027]
[null,null,null,null,null,2028]
[null,"Ramp Entrance Crash Analysis",null,null,null,"Year"]
[null,"Overdispersion parameter (ksc,EN,at,fi):",null,null,null,null,0,null,1.1268874406814575,null,0,null,0]
[null,"Observed crash count (N*o,sc,EN,at,fi), crashes:",null,null,null,null,0,null,0,null,0,null,0]
[null,"Reference year (r):",null,null,null,null,2005,null,2005,null,2005,null,2005]
[null,"Predicted average crash freq. for reference year (Np,sc,EN,at,fi,r), crashes/yr:",null,null,null,null,0,null,0.19824428856372833,null,0,null,0]
[null,"Equivalent years associated with crash count (Cb,sc,EN,at,fi,r), yr:",null,null,null,null,3,null,3,null,3,null,3]
[null,"Expected average crash freq. for reference year given N*o (Na,sc,EN,at,fi,r), crashes/yr:",null,null,null,null,0,null,0.11869514733552933,null,0,null,0]
[null,{"$f":"IF(Main!$AC$14=TRUE, \"Expected average crash frequency\", \"Predicted average crash frequency\")","v":"Expected average crash frequency"},null,null,null,{"$f":"F154","v":2005},0,null,0.11869514733552933,null,0,null,0]
[null,"  (Ne,sc,EN,at,fi), crashes/yr:","(Np,sc,EN,at,fi), crashes/yr:",null,null,{"$f":"F155","v":2006},0,null,0.11869514733552933,null,0,null,0]
[null,null,null,null,null,2007,0,null,0.11869514733552933,null,0,null,0]
[null,null,null,null,null,2008]
[null,null,null,null,null,2009]
[null,null,null,null,null,2010]
[null,null,null,null,null,2011]
[null,null,null,null,null,2012]
[null,null,null,null,null,2013,null,0,null,0.11869514733552933,null,0,null,0]
[null,null,null,null,null,2014,null,0,null,0.11869514733552933,null,0,null,0]
[null,null,null,null,null,2015,null,0,null,0.11869514733552933,null,0,null,0]
[null,null,null,null,null,2016]
[null,null,null,null,null,2017]
[null,null,null,null,null,2018]
[null,null,null,null,null,2019]
[null,null,null,null,null,2020]
[null,null,null,null,null,2021]
[null,null,null,null,null,2022]
[null,null,null,null,null,2023]
[null,null,null,null,null,2024]
[null,null,null,null,null,2025]
[null,null,null,null,null,2026]
[null,null,null,null,null,2027]
[null,null,null,null,null,2028]
[null,"Ramp Exit Crash Analysis",null,null,null,"Year"]
[null,"Overdispersion parameter (ksc,EX,at,fi):",null,null,null,null,0,null,0.56179779767990112,null,0,null,0]
[null,"Observed crash count (N*o,sc,EX,at,fi), crashes:",null,null,null,null,0,null,0,null,0,null,0]
[null,"Reference year (r):",null,null,null,null,2005,null,2005,null,2005,null,2005]
[null,"Predicted average crash freq. for reference year (Np,sc,EX,at,fi,r), crashes/yr:",null,null,null,null,0,null,0.10003302991390228,null,0,null,0]
[null,"Equivalent years associated with crash count (Cb,sc,EX,at,fi,r), yr:",null,null,null,null,3,null,3,null,3,null,3]
[null,"Expected average crash freq. for reference year given N*o (Na,sc,EX,at,fi,r), crashes/yr:",null,null,null,null,0,null,8.5601106286048889E-2,null,0,null,0]
[null,{"$f":"IF(Main!$AC$14=TRUE, \"Expected average crash frequency\", \"Predicted average crash frequency\")","v":"Expected average crash frequency"},null,null,null,{"$f":"F185","v":2005},0,null,8.5601106286048889E-2,null,0,null,0]
[null,"  (Ne,sc,EX,at,fi), crashes/yr:","(Np,sc,EX,at,fi), crashes/yr:",null,null,{"$f":"F186","v":2006},0,null,8.5601106286048889E-2,null,0,null,0]
[null,null,null,null,null,2007,0,null,8.5601106286048889E-2,null,0,null,0]
[null,null,null,null,null,2008]
[null,null,null,null,null,2009]
[null,null,null,null,null,2010]
[null,null,null,null,null,2011]
[null,null,null,null,null,2012]
[null,null,null,null,null,2013,null,0,null,8.5601106286048889E-2,null,0,null,0]
[null,null,null,null,null,2014,null,0,null,8.5601106286048889E-2,null,0,null,0]
[null,null,null,null,null,2015,null,0,null,8.5601106286048889E-2,null,0,null,0]
[null,null,null,null,null,2016]
[null,null,null,null,null,2017]
[null,null,null,null,null,2018]
[null,null,null,null,null,2019]
[null,null,null,null,null,2020]
[null,null,null,null,null,2021]
[null,null,null,null,null,2022]
[null,null,null,null,null,2023]
[null,null,null,null,null,2024]
[null,null,null,null,null,2025]
[null,null,null,null,null,2026]
[null,null,null,null,null,2027]
[null,null,null,null,null,2028]
[null,"Project Level Crash Analysis",null,null,null,"Year","Project"]
[null,"Observed crash count (N*o,aS,ac,at,fi), crashes:"]
[null,"Reference year (r):"]
[null,"Predicted average crash freq. for reference year (Np,aS,ac,at,fi,r), crashes/yr:"]
[null,"Equivalent years associated with crash count (Cb,aS,ac,at,fi,r), yr:"]
[null,"Independent sites crash analysis"]
[null,"   Variance when site crash frequencies are independent (V0,aS,ac,at,fi):"]
[null,"   Weight associated with Np,...r (w0,aS,ac,at,fi):"]
[null,"   Expected average crash freq. for reference year given N*o (N0,aS,ac,at,fi,r), crashes/yr:"]
[null,"Correlated sites crash analysis"]
[null,"   Variance when site crash frequencies are correlated (V1,aS,ac,at,fi):"]
[null,"   Weight associated with Np,...r (w1,aS,ac,at,fi):"]
[null,"   Expected average crash freq. for reference year given N*o (N1,aS,ac,at,fi,r), crashes/yr:"]
[null,"Expected average crash frequency",null,null,null,{"$f":"F216","v":2005}]
[null,"  (Ne,aS,ac,at,fi), crashes/year:",null,null,null,{"$f":"F217","v":2006}]
[null,null,null,null,null,2007]
[null,null,null,null,null,2008]
[null,null,null,null,null,2009]
[null,null,null,null,null,2010]
[null,null,null,null,null,2011]
[null,null,null,null,null,2012]
[null,null,null,null,null,2013]
[null,null,null,null,null,2014]
[null,null,null,null,null,2015]
[null,null,null,null,null,2016]
[null,null,null,null,null,2017]
[null,null,null,null,null,2018]
[null,null,null,null,null,2019]
[null,null,null,null,null,2020]
[null,null,null,null,null,2021]
[null,null,null,null,null,2022]
[null,null,null,null,null,2023]
[null,null,null,null,null,2024]
[null,null,null,null,null,2025]
[null,null,null,null,null,2026]
[null,null,null,null,null,2027]
[null,null,null,null,null,2028]
[null,"Property-Damage-Only Crash Frequency"]
[null,"Freeway Segment Multiple-Vehicle Crash Analysis",null,null,null,"Year"]
[null,"Overdispersion parameter (kfs,n,mv,pdo):",null,null,null,null,0.59101653099060059,null,2.9550826549530029,null,0.6648937463760376,null,0.21276596188545227]
[null,"Observed crash count (N*o,fs,n,mv,pdo), crashes:",null,null,null,null,1,null,1,null,7,null,4]
[null,"Reference year (r):",null,null,null,null,2005,null,2005,null,2005,null,2005]
[null,"Predicted average crash freq. for reference year (Np,fs,n,mv,pdo,r), crashes/yr:",null,null,null,null,1.0407571792602539,null,0.19704510271549225,null,0.36163800954818726,null,0.58322733640670776]
[null,"Equivalent years associated with crash count (Cb,fs,n,mv,pdo,r), yr:",null,null,null,null,3,null,3,null,3.1705386638641357,null,3]
[null,"Expected average crash freq. for reference year given N*o (Na,fs,n,mv,pdo,r), crashes/yr:",null,null,null,null,0.58196097612380981,null,0.28371721506118774,null,1.1602597236633301,null,0.78671753406524658]
[null,{"$f":"IF(Main!$AC$14=TRUE, \"Expected average crash frequency\", \"Predicted average crash frequency\")","v":"Expected average crash frequency"},null,null,null,{"$f":"Main!$AC$5","v":2005},0.58196097612380981,null,0.28371721506118774,null,1.1602597236633301,null,0.78671753406524658]
[null,"  (Ne,fs,n,mv,pdo), crashes/yr:","(Np,fs,n,mv,pdo), crashes/yr:",null,null,{"$f":"F285+1","v":2006},0.58196097612380981,null,0.28371721506118774,null,1.2256391048431396,null,0.78671753406524658]
[null,null,null,null,null,{"$f":"F286+1","v":2007},0.58196097612380981,null,0.28371721506118774,null,1.2927495241165161,null,0.78671753406524658]
[null,null,null,null,null,2008]
[null,null,null,null,null,2009]
[null,null,null,null,null,2010]
[null,null,null,null,null,2011]
[null,null,null,null,null,2012]
[null,null,null,null,null,2013,null,0.58196097612380981,null,0.28371721506118774,null,1.2927495241165161,null,0.78671753406524658]
[null,null,null,null,null,2014,null,0.58196097612380981,null,0.28371721506118774,null,1.2927495241165161,null,0.78671753406524658]
[null,null,null,null,null,2015,null,0.58196097612380981,null,0.28371721506118774,null,1.2927495241165161,null,0.78671753406524658]
[null,null,null,null,null,2016]
[null,null,null,null,null,2017]
[null,null,null,null,null,2018]
[null,null,null,null,null,2019]
[null,null,null,null,null,2020]
[null,null,null,null,null,2021]
[null,null,null,null,null,2022]
[null,null,null,null,null,2023]
[null,null,null,null,null,2024]
[null,null,null,null,null,2025]
[null,null,null,null,null,2026]
[null,null,null,null,null,2027]
[null,null,null,null,null,2028]
[null,"Freeway Segment Single-Vehicle Crash Analysis",null,null,null,"Year"]
[null,"Overdispersion parameter (kfs,n,sv,pdo):",null,null,null,null,0.53676861524581909,null,2.6838433742523193,null,0.60386472940444946,null,0.19323672354221344]
[null,"Observed crash count (N*o,fs,n,sv,pdo), crashes:",null,null,null,null,1,null,0,null,0,null,1]
[null,"Reference year (r):",null,null,null,null,2005,null,2005,null,2005,null,2005]
[null,"Predicted average crash freq. for reference year (Np,fs,n,sv,pdo,r), crashes/yr:",null,null,null,null,0.59978806972503662,null,0.11000074446201324,null,0.34331619739532471,null,1.0008175373077393]
[null,"Equivalent years associated with crash count (Cb,fs,n,sv,pdo,r), yr:",null,null,null,null,3,null,3,null,3.0752568244934082,null,3]
[null,"Expected average crash freq. for reference year given N*o (Na,fs,n,sv,pdo,r), crashes/yr:",null,null,null,null,0.46887561678886414,null,5.8334965258836746E-2,null,0.2096521407365799,null,0.75574249029159546]
[null,{"$f":"IF(Main!$AC$14=TRUE, \"Expected average crash frequency\", \"Predicted average crash frequency\")","v":"Expected average crash frequency"},null,null,null,{"$f":"F285","v":2005},0.46887561678886414,null,5.8334965258836746E-2,null,0.2096521407365799,null,0.75574249029159546]
[null,"  (Ne,fs,n,sv,pdo), crashes/yr:","(Np,fs,n,sv,pdo), crashes/yr:",null,null,{"$f":"F286","v":2006},0.46887561678886414,null,5.8334965258836746E-2,null,0.21491743624210358,null,0.75574249029159546]
[null,null,null,null,null,2007,0.46887561678886414,null,5.8334965258836746E-2,null,0.22016455233097076,null,0.75574249029159546]
[null,null,null,null,null,2008]
[null,null,null,null,null,2009]
[null,null,null,null,null,2010]
[null,null,null,null,null,2011]
[null,null,null,null,null,2012]
[null,null,null,null,null,2013,null,0.46887561678886414,null,5.8334965258836746E-2,null,0.22016455233097076,null,0.75574249029159546]
[null,null,null,null,null,2014,null,0.46887561678886414,null,5.8334965258836746E-2,null,0.22016455233097076,null,0.75574249029159546]
[null,null,null,null,null,2015,null,0.46887561678886414,null,5.8334965258836746E-2,null,0.22016455233097076,null,0.75574249029159546]
[null,null,null,null,null,2016]
[null,null,null,null,null,2017]
[null,null,null,null,null,2018]
[null,null,null,null,null,2019]
[null,null,null,null,null,2020]
[null,null,null,null,null,2021]
[null,null,null,null,null,2022]
[null,null,null,null,null,2023]
[null,null,null,null,null,2024]
[null,null,null,null,null,2025]
[null,null,null,null,null,2026]
[null,null,null,null,null,2027]
[null,null,null,null,null,2028]
[null,"Ramp Entrance Crash Analysis",null,null,null,"Year"]
[null,"Overdispersion parameter (ksc,EN,at,pdo):",null,null,null,null,0,null,1.1859582662582397,null,0,null,0]
[null,"Observed crash count (N*o,sc,EN,at,pdo), crashes:",null,null,null,null,0,null,6,null,0,null,0]
[null,"Reference year (r):",null,null,null,null,2005,null,2005,null,2005,null,2005]
[null,"Predicted average crash freq. for reference year (Np,sc,EN,at,pdo,r), crashes/yr:",null,null,null,null,0,null,0.33465397357940674,null,0,null,0]
[null,"Equivalent years associated with crash count (Cb,sc,EN,at,pdo,r), yr:",null,null,null,null,3,null,3,null,3,null,3]
[null,"Expected average crash freq. for reference year given N*o (Na,sc,EN,at,pdo,r), crashes/yr:",null,null,null,null,0,null,1.2397960424423218,null,0,null,0]
[null,{"$f":"IF(Main!$AC$14=TRUE, \"Expected average crash frequency\", \"Predicted average crash frequency\")","v":"Expected average crash frequency"},null,null,null,{"$f":"F316","v":2005},0,null,1.2397960424423218,null,0,null,0]
[null,"  (Ne,sc,EN,at,pdo), crashes/yr:","(Np,sc,EN,at,pdo), crashes/yr:",null,null,{"$f":"F317","v":2006},0,null,1.2397960424423218,null,0,null,0]
[null,null,null,null,null,2007,0,null,1.2397960424423218,null,0,null,0]
[null,null,null,null,null,2008]
[null,null,null,null,null,2009]
[null,null,null,null,null,2010]
[null,null,null,null,null,2011]
[null,null,null,null,null,2012]
[null,null,null,null,null,2013,null,0,null,1.2397960424423218,null,0,null,0]
[null,null,null,null,null,2014,null,0,null,1.2397960424423218,null,0,null,0]
[null,null,null,null,null,2015,null,0,null,1.2397960424423218,null,0,null,0]
[null,null,null,null,null,2016]
[null,null,null,null,null,2017]
[null,null,null,null,null,2018]
[null,null,null,null,null,2019]
[null,null,null,null,null,2020]
[null,null,null,null,null,2021]
[null,null,null,null,null,2022]
[null,null,null,null,null,2023]
[null,null,null,null,null,2024]
[null,null,null,null,null,2025]
[null,null,null,null,null,2026]
[null,null,null,null,null,2027]
[null,null,null,null,null,2028]
[null,"Ramp Exit Crash Analysis",null,null,null,"Year"]
[null,"Overdispersion parameter (ksc,EX,at,pdo):",null,null,null,null,0,null,0.6329113245010376,null,0,null,0]
[null,"Observed crash count (N*o,sc,EX,at,pdo), crashes:",null,null,null,null,0,null,0,null,0,null,0]
[null,"Reference year (r):",null,null,null,null,2005,null,2005,null,2005,null,2005]
[null,"Predicted average crash freq. for reference year (Np,sc,EX,at,pdo,r), crashes/yr:",null,null,null,null,0,null,0.22299650311470032,null,0,null,0]
[null,"Equivalent years associated with crash count (Cb,sc,EX,at,pdo,r), yr:",null,null,null,null,3,null,3,null,3,null,3]
[null,"Expected average crash freq. for reference year given N*o (Na,sc,EX,at,pdo,r), crashes/yr:",null,null,null,null,0,null,0.15666346251964569,null,0,null,0]
[null,{"$f":"IF(Main!$AC$14=TRUE, \"Expected average crash frequency\", \"Predicted average crash frequency\")","v":"Expected average crash frequency"},null,null,null,{"$f":"F347","v":2005},0,null,0.15666346251964569,null,0,null,0]
[null,"  (Ne,sc,EX,at,pdo), crashes/yr:","(Np,sc,EX,at,pdo), crashes/yr:",null,null,{"$f":"F348","v":2006},0,null,0.15666346251964569,null,0,null,0]
[null,null,null,null,null,2007,0,null,0.15666346251964569,null,0,null,0]
[null,null,null,null,null,2008]
[null,null,null,null,null,2009]
[null,null,null,null,null,2010]
[null,null,null,null,null,2011]
[null,null,null,null,null,2012]
[null,null,null,null,null,2013,null,0,null,0.15666346251964569,null,0,null,0]
[null,null,null,null,null,2014,null,0,null,0.15666346251964569,null,0,null,0]
[null,null,null,null,null,2015,null,0,null,0.15666346251964569,null,0,null,0]
[null,null,null,null,null,2016]
[null,null,null,null,null,2017]
[null,null,null,null,null,2018]
[null,null,null,null,null,2019]
[null,null,null,null,null,2020]
[null,null,null,null,null,2021]
[null,null,null,null,null,2022]
[null,null,null,null,null,2023]
[null,null,null,null,null,2024]
[null,null,null,null,null,2025]
[null,null,null,null,null,2026]
[null,null,null,null,null,2027]
[null,null,null,null,null,2028]
[null,"Project Level Crash Analysis",null,null,null,"Year","Project"]
[null,"Observed crash count (N*o,aS,ac,at,pdo), crashes:"]
[null,"Reference year (r):"]
[null,"Predicted average crash freq. for reference year (Np,aS,ac,at,pdo,r), crashes/yr:"]
[null,"Equivalent years associated with crash count (Cb,aS,ac,at,pdo,r), yr:"]
[null,"Independent sites crash analysis"]
[null,"   Variance when site crash frequencies are independent (V0,aS,ac,at,pdo):"]
[null,"   Weight associated with Np,...r (w0,aS,ac,at,pdo):"]
[null,"   Expected average crash freq. for reference year given N*o (N0,aS,ac,at,pdo,r), crashes/yr:"]
[null,"Correlated sites crash analysis"]
[null,"   Variance when site crash frequencies are correlated (V1,aS,ac,at,pdo):"]
[null,"   Weight associated with Np,...r (w1,aS,ac,at,pdo):"]
[null,"   Expected average crash freq. for reference year given N*o (N1,aS,ac,at,pdo,r), crashes/yr:"]
[null,"Expected average crash frequency",null,null,null,{"$f":"F378","v":2005}]
[null,"  (Ne,aS,ac,at,pdo), crashes/year:",null,null,null,{"$f":"F379","v":2006}]
[null,null,null,null,null,2007]
[null,null,null,null,null,2008]
[null,null,null,null,null,2009]
[null,null,null,null,null,2010]
[null,null,null,null,null,2011]
[null,null,null,null,null,2012]
[null,null,null,null,null,2013]
[null,null,null,null,null,2014]
[null,null,null,null,null,2015]
[null,null,null,null,null,2016]
[null,null,null,null,null,2017]
[null,null,null,null,null,2018]
[null,null,null,null,null,2019]
[null,null,null,null,null,2020]
[null,null,null,null,null,2021]
[null,null,null,null,null,2022]
[null,null,null,null,null,2023]
[null,null,null,null,null,2024]
[null,null,null,null,null,2025]
[null,null,null,null,null,2026]
[null,null,null,null,null,2027]
[null,null,null,null,null,2028]
[null,"Crash Severity Distribution",null,null,{"$f":"IF(Main!AC15=TRUE, \"Project Study Period\", \"\")","v":""}]
[null," (during Study Period)"]
[null,"Fatal crash frequency (N*e,w,x,at,K), crashes:",null,null,null,null,null,4.7980047762393951E-2,null,1.9676698371767998E-2,null,2.2765824571251869E-2,null,5.0004091113805771E-2]
[null,"Incapacitating injury crash freq. (N*e,w,x,at,A), crashes:",null,null,null,null,null,0.12601542472839355,null,3.7352964282035828E-2,null,5.8425974100828171E-2,null,0.13096299767494202]
[null,"Non-incapacitating inj. crash freq. (N*e,w,x,at,B), crashes:",null,null,null,null,null,0.88481301069259644,null,0.27688390016555786,null,0.31698691844940186,null,0.69055789709091187]
[null,"Possible injury crash freq. (N*e,w,x,at,C), crashes:",null,null,null,null,null,2.1469345092773438,null,0.56521338224411011,null,0.50913363695144653,null,1.0461111068725586]
[null,"  Total fatal-and-injury crash freq. (N*e,w,x,at,fi), crashes:",null,null,null,null,null,3.2057428359985352,null,0.89912688732147217,null,0.90731227397918701,null,1.9176360368728638]
[null,"Property-damage-only crash freq. (N*e,w,x,at,pdo), crashes:",null,null,null,null,null,3.1525096893310547,null,5.2155351638793945,null,4.5387420654296875,null,4.6273798942565918]
[null,"  Total crash frequency (N*e,w,x,at,as), crashes:",null,null,null,null,null,6.3582525253295898,null,6.1146621704101563,null,5.4460544586181641,null,6.545015811920166]
[null,"Intermediate Results"]
[null,"Proportion of segment length with curve 1 (Pc,1):",null,null,null,null,null,null,null,null,null,null,0.60000002384185791,0.60000002384185791]
[null,"Proportion of segment length with curve 2 (Pc,2):"]
[null,"Proportion of segment length with curve 3 (Pc,3):"]
[null,"Distance from edge of inside shoulder to barrier face (Wicb), ft:",null,null,null,null,0.75,0.75,0.75,0.75,0.75,0.75,0.75,0.75]
[null,"Proportion of segment length with barrier in the median (Pib):",null,null,null,null,1,1,1,1,1,1,1,1]
[null,"Proportion of segment length with rumble strips on outside shoulders (Por):",null,null,null,null,0,0,0,0,1,1,1,1]
[null,"Proportion of segment length with rumble strips on inside shoulders (Pir):",null,null,null,null,0,0,0,0,1,1,0.69999998807907104,0.69999998807907104]
[null,"Distance from edge of outside shoulder to barrier face (Wocb), ft:",null,null,null,null,2.5,2.5,2.5,2.5,999,999,999,999]
[null,"Proportion of segment length with barrier on the roadside (Pob):",null,null,null,null,0.19999998807907104,0.19999998807907104,9.9999994039535522E-2,9.9999994039535522E-2,0,0,0,0]
[null,"Proportion of segment length with Type B weaving, travel in increasing dir. (PwevB,inc):",null,null,null,null,0,0,0,0,1,1,3.9999999105930328E-2,3.9999999105930328E-2]
[null,"Proportion of segment length with Type B weaving, travel in decreasing dir. (PwevB,dec):",null,null,null,null,0,0,0,0,0,0,0,0]
[null,"Traffic Data",null,null,null,"Year"]
[null,"Freeway Segment Data ",null,null,null,{"$f":"Main!AC5","v":2005},85912,null,72140,null,47284,null,36968]
[null,"Average daily traffic (AADTfs) by year, veh/d:",null,null,null,{"$f":"F461+1","v":2006},85912,null,72140,null,48642,null,36968]
[null,null,null,null,null,{"$f":"F462+1","v":2007},85912,null,72140,null,50000,null,36968]
[null,null,null,null,null,2008,85912,null,72140,null,50000,null,36968]
[null,null,null,null,null,2009,85912,null,72140,null,50000,null,36968]
[null,null,null,null,null,2010,85912,null,72140,null,50000,null,36968]
[null,null,null,null,null,2011,85912,null,72140,null,50000,null,36968]
[null,null,null,null,null,2012,85912,null,72140,null,50000,null,36968]
[null,null,null,null,null,2013,85912,null,72140,null,50000,null,36968]
[null,null,null,null,null,2014,85912,null,72140,null,50000,null,36968]
[null,null,null,null,null,2015,85912,null,72140,null,50000,null,36968]
[null,null,null,null,null,2016,85912,null,72140,null,50000,null,36968]
[null,null,null,null,null,2017,85912,null,72140,null,50000,null,36968]
[null,null,null,null,null,2018,85912,null,72140,null,50000,null,36968]
[null,null,null,null,null,2019,85912,null,72140,null,50000,null,36968]
[null,null,null,null,null,2020,85912,null,72140,null,50000,null,36968]
[null,null,null,null,null,2021,85912,null,72140,null,50000,null,36968]
[null,null,null,null,null,2022,85912,null,72140,null,50000,null,36968]
[null,null,null,null,null,2023,85912,null,72140,null,50000,null,36968]
[null,null,null,null,null,2024,85912,null,72140,null,50000,null,36968]
[null,null,null,null,null,2025,85912,null,72140,null,50000,null,36968]
[null,null,null,null,null,2026,85912,null,72140,null,50000,null,36968]
[null,null,null,null,null,2027,85912,null,72140,null,50000,null,36968]
[null,null,null,null,null,2028,85912,null,72140,null,50000,null,36968]
[null,"Entrance Ramp Data for Travel in Increasing Milepost Dir.",null,null,null,"Year"]
[null,"Average daily traffic (AADTb,ent) by year, veh/d:",null,null,null,{"$f":"F461","v":2005},0,null,10145,null,1358,null,1358]
[null,null,null,null,null,2006,0,null,10145,null,1358,null,1358]
[null,null,null,null,null,2007,0,null,10145,null,1358,null,1358]
[null,null,null,null,null,2008,0,null,10145,null,1358,null,1358]
[null,null,null,null,null,2009,0,null,10145,null,1358,null,1358]
[null,null,null,null,null,2010,0,null,10145,null,1358,null,1358]
[null,null,null,null,null,2011,0,null,10145,null,1358,null,1358]
[null,null,null,null,null,2012,0,null,10145,null,1358,null,1358]
[null,null,null,null,null,2013,0,null,10145,null,1358,null,1358]
[null,null,null,null,null,2014,0,null,10145,null,1358,null,1358]
[null,null,null,null,null,2015,0,null,10145,null,1358,null,1358]
[null,null,null,null,null,2016,0,null,10145,null,1358,null,1358]
[null,null,null,null,null,2017,0,null,10145,null,1358,null,1358]
[null,null,null,null,null,2018,0,null,10145,null,1358,null,1358]
[null,null,null,null,null,2019,0,null,10145,null,1358,null,1358]
[null,null,null,null,null,2020,0,null,10145,null,1358,null,1358]
[null,null,null,null,null,2021,0,null,10145,null,1358,null,1358]
[null,null,null,null,null,2022,0,null,10145,null,1358,null,1358]
[null,null,null,null,null,2023,0,null,10145,null,1358,null,1358]
[null,null,null,null,null,2024,0,null,10145,null,1358,null,1358]
[null,null,null,null,null,2025,0,null,10145,null,1358,null,1358]
[null,null,null,null,null,2026,0,null,10145,null,1358,null,1358]
[null,null,null,null,null,2027,0,null,10145,null,1358,null,1358]
[null,null,null,null,null,2028,0,null,10145,null,1358,null,1358]
[null,"Exit Ramp Data for Travel in Increasing Milepost Direction",null,null,null,"Year"]
[null,"Average daily traffic (AADTe,ext) by year, veh/d:",null,null,null,2005,13295,null,13295,null,5765,null,5765]
[null,null,null,null,null,2006,13295,null,13295,null,5765,null,5765]
[null,null,null,null,null,2007,13295,null,13295,null,5765,null,5765]
[null,null,null,null,null,2008,13295,null,13295,null,5765,null,5765]
[null,null,null,null,null,2009,13295,null,13295,null,5765,null,5765]
[null,null,null,null,null,2010,13295,null,13295,null,5765,null,5765]
[null,null,null,null,null,2011,13295,null,13295,null,5765,null,5765]
[null,null,null,null,null,2012,13295,null,13295,null,5765,null,5765]
[null,null,null,null,null,2013,13295,null,13295,null,5765,null,5765]
[null,null,null,null,null,2014,13295,null,13295,null,5765,null,5765]
[null,null,null,null,null,2015,13295,null,13295,null,5765,null,5765]
[null,null,null,null,null,2016,13295,null,13295,null,5765,null,5765]
[null,null,null,null,null,2017,13295,null,13295,null,5765,null,5765]
[null,null,null,null,null,2018,13295,null,13295,null,5765,null,5765]
[null,null,null,null,null,2019,13295,null,13295,null,5765,null,5765]
[null,null,null,null,null,2020,13295,null,13295,null,5765,null,5765]
[null,null,null,null,null,2021,13295,null,13295,null,5765,null,5765]
[null,null,null,null,null,2022,13295,null,13295,null,5765,null,5765]
[null,null,null,null,null,2023,13295,null,13295,null,5765,null,5765]
[null,null,null,null,null,2024,13295,null,13295,null,5765,null,5765]
[null,null,null,null,null,2025,13295,null,13295,null,5765,null,5765]
[null,null,null,null,null,2026,13295,null,13295,null,5765,null,5765]
[null,null,null,null,null,2027,13295,null,13295,null,5765,null,5765]
[null,null,null,null,null,2028,13295,null,13295,null,5765,null,5765]
[null,"Entrance Ramp Data for Travel in Decreasing Milepost Dir.",null,null,null,"Year"]
[null,"Average daily traffic (AADTe,ent) by year, veh/d:",null,null,null,2005,13093,null,13093,null,4560,null,2912]
[null,null,null,null,null,2006,13093,null,13093,null,4560,null,2912]
[null,null,null,null,null,2007,13093,null,13093,null,4560,null,2912]
[null,null,null,null,null,2008,13093,null,13093,null,4560,null,2912]
[null,null,null,null,null,2009,13093,null,13093,null,4560,null,2912]
[null,null,null,null,null,2010,13093,null,13093,null,4560,null,2912]
[null,null,null,null,null,2011,13093,null,13093,null,4560,null,2912]
[null,null,null,null,null,2012,13093,null,13093,null,4560,null,2912]
[null,null,null,null,null,2013,13093,null,13093,null,4560,null,2912]
[null,null,null,null,null,2014,13093,null,13093,null,4560,null,2912]
[null,null,null,null,null,2015,13093,null,13093,null,4560,null,2912]
[null,null,null,null,null,2016,13093,null,13093,null,4560,null,2912]
[null,null,null,null,null,2017,13093,null,13093,null,4560,null,2912]
[null,null,null,null,null,2018,13093,null,13093,null,4560,null,2912]
[null,null,null,null,null,{"$f":"F525","v":2019},13093,null,13093,null,4560,null,2912]
[null,null,null,null,null,2020,13093,null,13093,null,4560,null,2912]
[null,null,null,null,null,2021,13093,null,13093,null,4560,null,2912]
[null,null,null,null,null,2022,13093,null,13093,null,4560,null,2912]
[null,null,null,null,null,2023,13093,null,13093,null,4560,null,2912]
[null,null,null,null,null,2024,13093,null,13093,null,4560,null,2912]
[null,null,null,null,null,2025,13093,null,13093,null,4560,null,2912]
[null,null,null,null,null,2026,13093,null,13093,null,4560,null,2912]
[null,null,null,null,null,2027,13093,null,13093,null,4560,null,2912]
[null,null,null,null,null,2028,13093,null,13093,null,4560,null,2912]
[null,"Exit Ramp Data for Travel in Decreasing Milepost Direction",null,null,null,"Year"]
[null,"Average daily traffic (AADTb,ext) by year, veh/d:",null,null,null,2005,0,null,11000,null,0,null,0]
[null,null,null,null,null,2006,0,null,11000,null,0,null,0]
[null,null,null,null,null,2007,0,null,11000,null,0,null,0]
[null,null,null,null,null,2008,0,null,11000,null,0,null,0]
[null,null,null,null,null,2009,0,null,11000,null,0,null,0]
[null,null,null,null,null,2010,0,null,11000,null,0,null,0]
[null,null,null,null,null,2011,0,null,11000,null,0,null,0]
[null,null,null,null,null,2012,0,null,11000,null,0,null,0]
[null,null,null,null,null,2013,0,null,11000,null,0,null,0]
[null,null,null,null,null,2014,0,null,11000,null,0,null,0]
[null,null,null,null,null,2015,0,null,11000,null,0,null,0]
[null,null,null,null,null,2016,0,null,11000,null,0,null,0]
[null,null,null,null,null,2017,0,null,11000,null,0,null,0]
[null,null,null,null,null,2018,0,null,11000,null,0,null,0]
[null,null,null,null,null,2019,0,null,11000,null,0,null,0]
[null,null,null,null,null,2020,0,null,11000,null,0,null,0]
[null,null,null,null,null,2021,0,null,11000,null,0,null,0]
[null,null,null,null,null,2022,0,null,11000,null,0,null,0]
[null,null,null,null,null,2023,0,null,11000,null,0,null,0]
[null,null,null,null,null,2024,0,null,11000,null,0,null,0]
[null,null,null,null,null,2025,0,null,11000,null,0,null,0]
[null,null,null,null,null,2026,0,null,11000,null,0,null,0]
[null,null,null,null,null,2027,0,null,11000,null,0,null,0]
[null,null,null,null,null,2028,0,null,11000,null,0,null,0]

{"sheet":"Output Ramp Segments","index":8,"n_rows":340,"n_cols":86,"rows_kept":340,"cut":false,"hidden":false,"merged":[[4,10,5,10],[4,11,5,11],[4,12,5,12],[4,13,5,13],[4,6,5,6],[4,7,5,7],[4,8,5,8],[4,9,5,9],[4,18,5,18],[4,19,5,19],[4,20,5,20],[4,21,5,21],[4,14,5,14],[4,15,5,15],[4,16,5,16],[4,17,5,17],[4,26,5,26],[4,27,5,27],[4,28,5,28],[4,29,5,29],[4,22,5,22],[4,23,5,23],[4,24,5,24],[4,25,5,25],[4,34,5,34],[4,35,5,35],[4,36,5,36],[4,37,5,37],[4,30,5,30],[4,31,5,31],[4,32,5,32],[4,33,5,33],[4,42,5,42],[4,43,5,43],[4,44,5,44],[4,45,5,45],[4,38,5,38],[4,39,5,39],[4,40,5,40],[4,41,5,41],[4,50,5,50],[4,51,5,51],[4,52,5,52],[4,53,5,53],[4,46,5,46],[4,47,5,47],[4,48,5,48],[4,49,5,49],[4,58,5,58],[4,59,5,59],[4,60,5,60],[4,61,5,61],[4,54,5,54],[4,55,5,55],[4,56,5,56],[4,57,5,57],[4,66,5,66],[4,67,5,67],[4,68,5,68],[4,69,5,69],[4,62,5,62],[4,63,5,63],[4,64,5,64],[4,65,5,65],[4,74,5,74],[4,75,5,75],[4,76,5,76],[4,77,5,77],[4,70,5,70],[4,71,5,71],[4,72,5,72],[4,73,5,73],[4,82,5,82],[4,83,5,83],[4,84,5,84],[4,85,5,85],[4,78,5,78],[4,79,5,79],[4,80,5,80],[4,81,5,81],[4,4,5,5],[278,4,279,5],[280,4,280,5],[281,4,281,5],[286,4,286,5],[282,4,282,5],[283,4,283,5],[284,4,284,5],[285,4,285,5]]}
[]
[]
[null,null,null,null,"Output Worksheet for Ramp Segments"]
[null,"    MV = multiple-vehicle model",null,null,null,null,{"$f":"\"Segment \"& TEXT(INT((COLUMN()-5)/2),\"0\")","v":"Segment 1"},null,{"$f":"\"Segment \"& TEXT(INT((COLUMN()-5)/2),\"0\")","v":"Segment 2"},null,{"$f":"\"Segment \"& TEXT(INT((COLUMN()-5)/2),\"0\")","v":"Segment 3"},null,{"$f":"\"Segment \"& TEXT(INT((COLUMN()-5)/2),\"0\")","v":"Segment 4"},null,{"$f":"\"Segment \"& TEXT(INT((COLUMN()-5)/2),\"0\")","v":"Segment 5"},null,{"$f":"\"Segment \"& TEXT(INT((COLUMN()-5)/2),\"0\")","v":"Segment 6"},null,{"$f":"\"Segment \"& TEXT(INT((COLUMN()-5)/2),\"0\")","v":"Segment 7"},null,{"$f":"\"Segment \"& TEXT(INT((COLUMN()-5)/2),\"0\")","v":"Segment 8"},null,{"$f":"\"Segment \"& TEXT(INT((COLUMN()-5)/2),\"0\")","v":"Segment 9"},null,{"$f":"\"Segment \"& TEXT(INT((COLUMN()-5)/2),\"0\")","v":"Segment 10"},null,{"$f":"\"Segment \"& TEXT(INT((COLUMN()-5)/2),\"0\")","v":"Segment 11"},null,{"$f":"\"Segment \"& TEXT(INT((COLUMN()-5)/2),\"0\")","v":"Segment 12"},null,{"$f":"\"Segment \"& TEXT(INT((COLUMN()-5)/2),\"0\")","v":"Segment 13"},null,{"$f":"\"Segment \"& TEXT(INT((COLUMN()-5)/2),\"0\")","v":"Segment 14"},null,{"$f":"\"Segment \"& TEXT(INT((COLUMN()-5)/2),\"0\")","v":"Segment 15"},null,{"$f":"\"Segment \"& TEXT(INT((COLUMN()-5)/2),\"0\")","v":"Segment 16"},null,{"$f":"\"Segment \"& TEXT(INT((COLUMN()-5)/2),\"0\")","v":"Segment 17"},null,{"$f":"\"Segment \"& TEXT(INT((COLUMN()-5)/2),\"0\")","v":"Segment 18"},null,{"$f":"\"Segment \"& TEXT(INT((COLUMN()-5)/2),\"0\")","v":"Segment 19"},null,{"$f":"\"Segment \"& TEXT(INT((COLUMN()-5)/2),\"0\")","v":"Segment 20"},null,{"$f":"\"Segment \"& TEXT(INT((COLUMN()-5)/2),\"0\")","v":"Segment 21"},null,{"$f":"\"Segment \"& TEXT(INT((COLUMN()-5)/2),\"0\")","v":"Segment 22"},null,{"$f":"\"Segment \"& TEXT(INT((COLUMN()-5)/2),\"0\")","v":"Segment 23"},null,{"$f":"\"Segment \"& TEXT(INT((COLUMN()-5)/2),\"0\")","v":"Segment 24"},null,{"$f":"\"Segment \"& TEXT(INT((COLUMN()-5)/2),\"0\")","v":"Segment 25"},null,{"$f":"\"Segment \"& TEXT(INT((COLUMN()-5)/2),\"0\")","v":"Segment 26"},null,{"$f":"\"Segment \"& TEXT(INT((COLUMN()-5)/2),\"0\")","v":"Segment 27"},null,{"$f":"\"Segment \"& TEXT(INT((COLUMN()-5)/2),\"0\")","v":"Segment 28"},null,{"$f":"\"Segment \"& TEXT(INT((COLUMN()-5)/2),\"0\")","v":"Segment 29"},null,{"$f":"\"Segment \"& TEXT(INT((COLUMN()-5)/2),\"0\")","v":"Segment 30"},null,{"$f":"\"Segment \"& TEXT(INT((COLUMN()-5)/2),\"0\")","v":"Segment 31"},null,{"$f":"\"Segment \"& TEXT(INT((COLUMN()-5)/2),\"0\")","v":"Segment 32"},null,{"$f":"\"Segment \"& TEXT(INT((COLUMN()-5)/2),\"0\")","v":"Segment 33"},null,{"$f":"\"Segment \"& TEXT(INT((COLUMN()-5)/2),\"0\")","v":"Segment 34"},null,{"$f":"\"Segment \"& TEXT(INT((COLUMN()-5)/2),\"0\")","v":"Segment 35"},null,{"$f":"\"Segment \"& TEXT(INT((COLUMN()-5)/2),\"0\")","v":"Segment 36"},null,{"$f":"\"Segment \"& TEXT(INT((COLUMN()-5)/2),\"0\")","v":"Segment 37"},null,{"$f":"\"Segment \"& TEXT(INT((COLUMN()-5)/2),\"0\")","v":"Segment 38"},null,{"$f":"\"Segment \"& TEXT(INT((COLUMN()-5)/2),\"0\")","v":"Segment 39"},null,{"$f":"\"Segment \"& TEXT(INT((COLUMN()-5)/2),\"0\")","v":"Segment 40"}]
[null,"    SV = single-vehicle model",null,null,"Applicable Models",null,{"$f":"IF(Main!$AG$14=TRUE, \"Crash Period\", \"Study Period\")","v":"Crash Period"},{"$f":"IF(Main!$AG$14=TRUE, \"Study Period\", \"\")","v":"Study Period"},{"$f":"G5","v":"Crash Period"},"Study Period","Crash Period","Study Period","Crash Period","Study Period","Crash Period","Study Period","Crash Period","Study Period","Crash Period","Study Period","Crash Period","Study Period","Crash Period","Study Period","Crash Period","Study Period","Crash Period","Study Period","Crash Period","Study Period","Crash Period","Study Period","Crash Period","Study Period","Crash Period","Study Period","Crash Period","Study Period","Crash Period","Study Period",{"$f":"AM5","v":"Crash Period"},"Study Period","Crash Period","Study Period","Crash Period","Study Period","Crash Period","Study Period","Crash Period","Study Period","Crash Period","Study Period","Crash Period","Study Period","Crash Period","Study Period","Crash Period","Study Period","Crash Period","Study Period","Crash Period","Study Period","Crash Period","Study Period","Crash Period","Study Period","Crash Period","Study Period","Crash Period","Study Period","Crash Period","Study Period",{"$f":"BS5","v":"Crash Period"},"Study Period","Crash Period","Study Period","Crash Period","Study Period","Crash Period","Study Period","Crash Period","Study Period","Crash Period","Study Period","Crash Period","Study Period"]
[]
[null,"Crash Modification Factors"]
[null,"Fatal-and-Injury Crash CMFs"]
[null,"Horizontal curve (CMF1,w,x,y,fi):",null,null,"MV",null,1.0036793947219849,1.0036793947219849,1.1412938833236694,1.1412938833236694,1.0533772706985474,1.0533772706985474,1,1,1.161476731300354,1.161476731300354,1.0883635282516479,1.0883635282516479]
[null,null,null,null,null,"SV",1.0113638639450073,1.0113638639450073,1.4363968372344971,1.4363968372344971,1.1648597717285156,1.1648597717285156,1,1,1.4987329244613647,1.4987329244613647,1.2729173898696899,1.2729173898696899]
[null,"Lane width (CMF2, w,x,y,fi):",null,null,"MV","SV",1.0959264039993286,1.0959264039993286,1.0959264039993286,1.1472870111465454,1.1009572744369507,1.1009572744369507,1.0959264039993286,1.0959264039993286,1.0959264039993286,1.0959264039993286,1.0959264039993286,1.0959264039993286]
[null,"Right shoulder width (CMF3,w,x,y,fi):",null,null,"MV","SV",0.98396003246307373,0.98396003246307373,0.98396003246307373,0.98396003246307373,1.0328686237335205,1.0328686237335205,1.1138249635696411,1.1138249635696411,1,1,1,1]
[null,"Left shoulder width (CMF4,w,x,y,fi):",null,null,"MV","SV",0.96297293901443481,0.96297293901443481,0.96297293901443481,0.96297293901443481,1.0163013935089111,1.0163013935089111,1,1,0.89780712127685547,0.89780712127685547,0.89780712127685547,0.89780712127685547]
[null,"Right side barrier (CMF5,w,x,y,fi):",null,null,"MV","SV",1.1587767601013184,1.1587767601013184,1.1978474855422974,1.1978474855422974,1,1,1,1,1,1,1,1]
[null,"Left side barrier (CMF6,w,x,y,fi):",null,null,"MV","SV",1.001090407371521,1.001090407371521,1.1873319149017334,1.1873319149017334,1.0274326801300049,1.0274326801300049,1,1,1,1,1,1]
[null,"Weaving section (CMF9,cds,ac,at,fi):",null,null,"MV","SV"]
[null,null,null,null,"Year:",{"$f":"Main!$AG$5","v":2005},1,1,1,1,1,1,1.3302518129348755,1.3302518129348755,1,1,1,1]
[null,null,null,null,null,{"$f":"F17+1","v":2006},1,1,1,1,1,1,1.3302518129348755,1.3302518129348755,1,1,1,1]
[null,null,null,null,null,{"$f":"F18+1","v":2007},1,1,1,1,1,1,1.3302518129348755,1.3302518129348755,1,1,1,1]
[null,null,null,null,null,2008]
[null,null,null,null,null,2009]
[null,null,null,null,null,2010]
[null,null,null,null,null,2011]
[null,null,null,null,null,2012]
[null,null,null,null,null,2013,1,1,1,1,1,1,1.3302518129348755,1.3302518129348755,1,1,1,1]
[null,null,null,null,null,2014,1,1,1,1,1,1,1.3302518129348755,1.3302518129348755,1,1,1,1]
[null,null,null,null,null,2015,1,1,1,1,1,1,1.3302518129348755,1.3302518129348755,1,1,1,1]
[null,null,null,null,null,2016]
[null,null,null,null,null,2017]
[null,null,null,null,null,2018]
[null,null,null,null,null,2019]
[null,null,null,null,null,2020]
[null,null,null,null,null,2021]
[null,null,null,null,null,2022]
[null,null,null,null,null,2023]
[null,null,null,null,null,2024]
[null,null,null,null,null,2025]
[null,null,null,null,null,2026]
[null,null,null,null,null,2027]
[null,null,null,null,null,2028]
[null,"Ramp speed-change lane (CMF8,w,x,mv,fi):",null,null,"MV",null,1.0374011993408203,1.0374011993408203,1,1,1.1376653909683228,1.1376653909683228,1,1,1,1,1,1]
[null,"Lane add or drop (CMF7,w,x,y,fi):",null,null,"MV","SV",1,1,1.082028865814209,1.082028865814209,0.95116782188415527,0.95116782188415527,1,1,1,1,1,1]
[null,"Property-Damage-Only Crash CMFs"]
[null,"Horizontal curve (CMF1,w,x,y,pdo):",null,null,"MV",null,1.00257408618927,1.00257408618927,1.0988513231277466,1.0988513231277466,1.0373435020446777,1.0373435020446777,1,1,1.1129715442657471,1.1129715442657471,1.061820387840271,1.061820387840271]
[null,null,null,null,null,"SV",1.0148117542266846,1.0148117542266846,1.5688031911849976,1.5688031911849976,1.2148795127868652,1.2148795127868652,1,1,1.650052547454834,1.650052547454834,1.3557227849960327,1.3557227849960327]
[null,"Lane width (CMF2, w,x,y,pdo):",null,null,"MV","SV",1,1,1,1,1,1,1,1,1,1,1,1]
[null,"Right shoulder width (CMF3,w,x,y,pdo):",null,null,"MV","SV",0.99226009845733643,0.99226009845733643,0.99226009845733643,0.99226009845733643,1.015661358833313,1.015661358833313,1.053165078163147,1.053165078163147,1,1,1,1]
[null,"Left shoulder width (CMF4,w,x,y,pdo):",null,null,"MV","SV",0.982033371925354,0.982033371925354,0.982033371925354,0.982033371925354,1.0078002214431763,1.0078002214431763,1,1,0.94951874017715454,0.94951874017715454,0.94951874017715454,0.94951874017715454]
[null,"Right side barrier (CMF5,w,x,y,pdo):",null,null,"MV","SV",1.1449480056762695,1.1449480056762695,1.1802407503128052,1.1802407503128052,1,1,1,1,1,1,1,1]
[null,"Left side barrier (CMF6,w,x,y,pdo):",null,null,"MV","SV",1.0009990930557251,1.0009990930557251,1.1706610918045044,1.1706610918045044,1.0251215696334839,1.0251215696334839,1,1,1,1,1,1]
[null,"Weaving section (CMF9,cds,ac,at,pdo):",null,null,"MV","SV"]
[null,null,null,null,"Year:",{"$f":"Main!$AG$5","v":2005},1,1,1,1,1,1,1.4086720943450928,1.4086720943450928,1,1,1,1]
[null,null,null,null,null,{"$f":"F52+1","v":2006},1,1,1,1,1,1,1.4086720943450928,1.4086720943450928,1,1,1,1]
[null,null,null,null,null,{"$f":"F53+1","v":2007},1,1,1,1,1,1,1.4086720943450928,1.4086720943450928,1,1,1,1]
[null,null,null,null,null,2008]
[null,null,null,null,null,2009]
[null,null,null,null,null,2010]
[null,null,null,null,null,2011]
[null,null,null,null,null,2012]
[null,null,null,null,null,2013,1,1,1,1,1,1,1.4086720943450928,1.4086720943450928,1,1,1,1]
[null,null,null,null,null,2014,1,1,1,1,1,1,1.4086720943450928,1.4086720943450928,1,1,1,1]
[null,null,null,null,null,2015,1,1,1,1,1,1,1.4086720943450928,1.4086720943450928,1,1,1,1]
[null,null,null,null,null,2016]
[null,null,null,null,null,2017]
[null,null,null,null,null,2018]
[null,null,null,null,null,2019]
[null,null,null,null,null,2020]
[null,null,null,null,null,2021]
[null,null,null,null,null,2022]
[null,null,null,null,null,2023]
[null,null,null,null,null,2024]
[null,null,null,null,null,2025]
[null,null,null,null,null,2026]
[null,null,null,null,null,2027]
[null,null,null,null,null,2028]
[null,"Ramp speed-change lane (CMF8,w,x,mv,pdo):",null,null,"MV",null,1,1,1,1,1,1,1,1,1,1,1,1]
[null,"Lane add or drop (CMF7,w,x,y,pdo):",null,null,"MV","SV",1,1,1,1,1,1,1,1,1,1,1,1]
[null,{"$f":"IF(Main!$AG$14=TRUE, \"Expected Average Crash Frequency\", \"Predicted Average Crash Frequency\")","v":"Expected Average Crash Frequency"}]
[null,"Fatal-and-Injury Crash Frequency"]
[null,"Multiple-Vehicle Crash Analysis",null,null,null,"Year"]
[null,"Overdispersion parameter (kw,x,mv,fi):",null,null,null,null,0.29779630899429321,null,1.1415524482727051,null,0.34246572852134705,null,0.38051748275756836,null,0.68493145704269409,null,0.34246572852134705]
[null,"Observed crash count (N*o,w,x,mv,fi), crashes:",null,null,null,null,0,null,0,null,0,null,0,null,0,null,0]
[null,"Reference year (r):",null,null,null,null,2005,null,2005,null,2005,null,2005,null,2005,null,2005]
[null,"Predicted average crash freq. for reference year (Np,w,x,mv,fi,r), crashes/yr:",null,null,null,null,6.7589539103209972E-3,null,2.6297804433852434E-3,null,3.3143159002065659E-2,null,4.3965838849544525E-2,null,2.6130254846066236E-3,null,2.1213525906205177E-2]
[null,"Equivalent years associated with crash count (Cb,w,x,mv,fi,r), yr:",null,null,null,null,3.0771124362945557,null,3,null,3.0269806385040283,null,3,null,3,null,3]
[null,"Expected average crash freq. for reference year given N*o (Na,w,x,mv,fi,r), crashes/yr:",null,null,null,null,6.7173494026064873E-3,null,2.6063076220452785E-3,null,3.2042268663644791E-2,null,4.1864681988954544E-2,null,2.5990703143179417E-3,null,2.0761044695973396E-2]
[null,{"$f":"IF(Main!$AG$14=TRUE, \"Expected average crash frequency\", \"Predicted average crash frequency\")","v":"Expected average crash frequency"},null,null,null,{"$f":"Main!$AG$5","v":2005},6.7173494026064873E-3,null,2.6063076220452785E-3,null,3.2042268663644791E-2,null,4.1864681988954544E-2,null,2.5990703143179417E-3,null,2.0761044695973396E-2]
[null,"  (Ne,w,x,mv,fi), crashes/yr:","(Np,w,x,mv,fi), crashes/yr:",null,null,{"$f":"F87+1","v":2006},6.8900026381015778E-3,null,2.6063076220452785E-3,null,3.2042268663644791E-2,null,4.1864681988954544E-2,null,2.5990703143179417E-3,null,2.0761044695973396E-2]
[null,null,null,null,null,{"$f":"F88+1","v":2007},7.0626889355480671E-3,null,2.6063076220452785E-3,null,3.2906793057918549E-2,null,4.1864681988954544E-2,null,2.5990703143179417E-3,null,2.0761044695973396E-2]
[null,null,null,null,null,2008]
[null,null,null,null,null,2009]
[null,null,null,null,null,2010]
[null,null,null,null,null,2011]
[null,null,null,null,null,2012]
[null,null,null,null,null,2013,null,7.6562906615436077E-3,null,2.7284522075206041E-3,null,3.8176726549863815E-2,null,4.1864681988954544E-2,null,2.5990703143179417E-3,null,2.0761044695973396E-2]
[null,null,null,null,null,2014,null,7.7552581205964088E-3,null,2.7284522075206041E-3,null,3.9071753621101379E-2,null,4.1864681988954544E-2,null,2.5990703143179417E-3,null,2.0761044695973396E-2]
[null,null,null,null,null,2015,null,7.7552581205964088E-3,null,2.7284522075206041E-3,null,3.9071753621101379E-2,null,4.1864681988954544E-2,null,2.5990703143179417E-3,null,2.0761044695973396E-2]
[null,null,null,null,null,2016]
[null,null,null,null,null,2017]
[null,null,null,null,null,2018]
[null,null,null,null,null,2019]
[null,null,null,null,null,2020]
[null,null,null,null,null,2021]
[null,null,null,null,null,2022]
[null,null,null,null,null,2023]
[null,null,null,null,null,2024]
[null,null,null,null,null,2025]
[null,null,null,null,null,2026]
[null,null,null,null,null,2027]
[null,null,null,null,null,2028]
[null,"Single-Vehicle Crash Analysis",null,null,null,"Year"]
[null,"Overdispersion parameter (kw,x,sv,fi):",null,null,null,null,0.54966193437576294,null,2.1070375442504883,null,0.63211125135421753,null,0.70234584808349609,null,1.2642225027084351,null,0.63211125135421753]
[null,"Observed crash count (N*o,w,x,sv,fi), crashes:",null,null,null,null,0,null,0,null,1,null,1,null,0,null,0]
[null,"Reference year (r):",null,null,null,null,2005,null,2005,null,2005,null,2005,null,2005,null,2005]
[null,"Predicted average crash freq. for reference year (Np,w,x,sv,fi,r), crashes/yr:",null,null,null,null,0.10959625989198685,null,5.5241804569959641E-2,null,8.9417733252048492E-2,null,4.98817078769207E-2,null,9.0393118560314178E-2,null,0.11138656735420227]
[null,"Equivalent years associated with crash count (Cb,w,x,sv,fi,r), yr:",null,null,null,null,3.0762999057769775,null,3,null,3.0248103141784668,null,3,null,3,null,3]
[null,"Expected average crash freq. for reference year given N*o (Na,w,x,sv,fi,r), crashes/yr:",null,null,null,null,9.2461399734020233E-2,null,4.0944430977106094E-2,null,0.12463163584470749,null,7.6839841902256012E-2,null,6.7315332591533661E-2,null,9.1961830854415894E-2]
[null,{"$f":"IF(Main!$AG$14=TRUE, \"Expected average crash frequency\", \"Predicted average crash frequency\")","v":"Expected average crash frequency"},null,null,null,{"$f":"F87","v":2005},9.2461399734020233E-2,null,4.0944430977106094E-2,null,0.12463163584470749,null,7.6839841902256012E-2,null,6.7315332591533661E-2,null,9.1961830854415894E-2]
[null,"  (Ne,w,x,sv,fi), crashes/yr:","(Np,w,x,sv,fi), crashes/yr:",null,null,{"$f":"F88","v":2006},9.4820603728294373E-2,null,4.0944430977106094E-2,null,0.12463163584470749,null,7.6839841902256012E-2,null,6.7315332591533661E-2,null,9.1961830854415894E-2]
[null,null,null,null,null,2007,9.7156979143619537E-2,null,4.0944430977106094E-2,null,0.12772378325462341,null,7.6839841902256012E-2,null,6.7315332591533661E-2,null,9.1961830854415894E-2]
[null,null,null,null,null,2008]
[null,null,null,null,null,2009]
[null,null,null,null,null,2010]
[null,null,null,null,null,2011]
[null,null,null,null,null,2012]
[null,null,null,null,null,2013,null,0.105010025203228,null,4.286329448223114E-2,null,0.14570429921150208,null,7.6839841902256012E-2,null,6.7315332591533661E-2,null,9.1961830854415894E-2]
[null,null,null,null,null,2014,null,0.10629250854253769,null,4.286329448223114E-2,null,0.14861515164375305,null,7.6839841902256012E-2,null,6.7315332591533661E-2,null,9.1961830854415894E-2]
[null,null,null,null,null,2015,null,0.10629250854253769,null,4.286329448223114E-2,null,0.14861515164375305,null,7.6839841902256012E-2,null,6.7315332591533661E-2,null,9.1961830854415894E-2]
[null,null,null,null,null,2016]
[null,null,null,null,null,2017]
[null,null,null,null,null,2018]
[null,null,null,null,null,2019]
[null,null,null,null,null,2020]
[null,null,null,null,null,2021]
[null,null,null,null,null,2022]
[null,null,null,null,null,2023]
[null,null,null,null,null,2024]
[null,null,null,null,null,2025]
[null,null,null,null,null,2026]
[null,null,null,null,null,2027]
[null,null,null,null,null,2028]
[null,"Project Level Crash Analysis",null,null,null,"Year","Project"]
[null,"Observed crash count (N*o,aS,ac,at,fi), crashes:"]
[null,"Reference year (r):"]
[null,"Predicted average crash freq. for reference year (Np,aS,ac,at,fi,r), crashes/yr:"]
[null,"Equivalent years associated with crash count (Cb,aS,ac,at,fi,r), yr:"]
[null,"Independent sites crash analysis"]
[null,"   Variance when site crash frequencies are independent (V0,aS,ac,at,fi):"]
[null,"   Weight associated with Np,...r (w0,aS,ac,at,fi):"]
[null,"   Expected average crash freq. for reference year given N*o (N0,aS,ac,at,fi,r), crashes/yr:"]
[null,"Correlated sites crash analysis"]
[null,"   Variance when site crash frequencies are correlated (V1,aS,ac,at,fi):"]
[null,"   Weight associated with Np,...r (w1,aS,ac,at,fi):"]
[null,"   Expected average crash freq. for reference year given N*o (N1,aS,ac,at,fi,r), crashes/yr:"]
[null,"Expected average crash frequency",null,null,null,{"$f":"F118","v":2005}]
[null,"  (Ne,aS,ac,at,fi), crashes/year:",null,null,null,{"$f":"F119","v":2006}]
[null,null,null,null,null,2007]
[null,null,null,null,null,2008]
[null,null,null,null,null,2009]
[null,null,null,null,null,2010]
[null,null,null,null,null,2011]
[null,null,null,null,null,2012]
[null,null,null,null,null,2013]
[null,null,null,null,null,2014]
[null,null,null,null,null,2015]
[null,null,null,null,null,2016]
[null,null,null,null,null,2017]
[null,null,null,null,null,2018]
[null,null,null,null,null,2019]
[null,null,null,null,null,2020]
[null,null,null,null,null,2021]
[null,null,null,null,null,2022]
[null,null,null,null,null,2023]
[null,null,null,null,null,2024]
[null,null,null,null,null,2025]
[null,null,null,null,null,2026]
[null,null,null,null,null,2027]
[null,null,null,null,null,2028]
[null,"Property-Damage-Only Crash Frequency"]
[null,"Multiple-Vehicle Crash Analysis",null,null,null,"Year"]
[null,"Overdispersion parameter (kw,x,mv,pdo):",null,null,null,null,0.34234851598739624,null,1.3123359680175781,null,0.39370077848434448,null,0.43744531273841858,null,0.78740155696868896,null,0.39370077848434448]
[null,"Observed crash count (N*o,w,x,mv,pdo), crashes:",null,null,null,null,0,null,0,null,0,null,1,null,0,null,0]
[null,"Reference year (r):",null,null,null,null,2005,null,2005,null,2005,null,2005,null,2005,null,2005]
[null,"Predicted average crash freq. for reference year (Np,w,x,mv,pdo,r), crashes/yr:",null,null,null,null,1.6933850944042206E-2,null,6.0999356210231781E-3,null,5.5089447647333145E-2,null,6.4426712691783905E-2,null,6.2392535619437695E-3,null,3.3413462340831757E-2]
[null,"Equivalent years associated with crash count (Cb,w,x,mv,pdo,r), yr:",null,null,null,null,3.13558030128479,null,3,null,3.0438032150268555,null,3,null,3,null,3]
[null,"Expected average crash freq. for reference year given N*o (Na,w,x,mv,pdo,r), crashes/yr:",null,null,null,null,1.6631525009870529E-2,null,5.9568784199655056E-3,null,5.1677867770195007E-2,null,8.5390180349349976E-2,null,6.1486326158046722E-3,null,3.2144874334335327E-2]
[null,{"$f":"IF(Main!$AG$14=TRUE, \"Expected average crash frequency\", \"Predicted average crash frequency\")","v":"Expected average crash frequency"},null,null,null,{"$f":"Main!$AG$5","v":2005},1.6631525009870529E-2,null,5.9568784199655056E-3,null,5.1677867770195007E-2,null,8.5390180349349976E-2,null,6.1486326158046722E-3,null,3.2144874334335327E-2]
[null,"  (Ne,w,x,mv,pdo), crashes/yr:","(Np,w,x,mv,pdo), crashes/yr:",null,null,{"$f":"F187+1","v":2006},1.7380945384502411E-2,null,5.9568784199655056E-3,null,5.1677867770195007E-2,null,8.5390180349349976E-2,null,6.1486326158046722E-3,null,3.2144874334335327E-2]
[null,null,null,null,null,{"$f":"F188+1","v":2007},1.8137013539671898E-2,null,5.9568784199655056E-3,null,5.3941521793603897E-2,null,8.5390180349349976E-2,null,6.1486326158046722E-3,null,3.2144874334335327E-2]
[null,null,null,null,null,2008]
[null,null,null,null,null,2009]
[null,null,null,null,null,2010]
[null,null,null,null,null,2011]
[null,null,null,null,null,2012]
[null,null,null,null,null,2013,null,2.0778613165020943E-2,null,5.9568784199655056E-3,null,6.7917928099632263E-2,null,8.5390180349349976E-2,null,6.1486326158046722E-3,null,3.2144874334335327E-2]
[null,null,null,null,null,2014,null,2.122456394135952E-2,null,5.9568784199655056E-3,null,7.0309199392795563E-2,null,8.5390180349349976E-2,null,6.1486326158046722E-3,null,3.2144874334335327E-2]
[null,null,null,null,null,2015,null,2.122456394135952E-2,null,5.9568784199655056E-3,null,7.0309199392795563E-2,null,8.5390180349349976E-2,null,6.1486326158046722E-3,null,3.2144874334335327E-2]
[null,null,null,null,null,2016]
[null,null,null,null,null,2017]
[null,null,null,null,null,2018]
[null,null,null,null,null,2019]
[null,null,null,null,null,2020]
[null,null,null,null,null,2021]
[null,null,null,null,null,2022]
[null,null,null,null,null,2023]
[null,null,null,null,null,2024]
[null,null,null,null,null,2025]
[null,null,null,null,null,2026]
[null,null,null,null,null,2027]
[null,null,null,null,null,2028]
[null,"Single-Vehicle Crash Analysis",null,null,null,"Year"]
[null,"Overdispersion parameter (kw,x,sv,pdo):",null,null,null,null,0.44501799345016479,null,1.7059023380279541,null,0.51177066564559937,null,0.56863409280776978,null,1.0235413312911987,null,0.51177066564559937]
[null,"Observed crash count (N*o,w,x,sv,pdo), crashes:",null,null,null,null,0,null,0,null,2,null,1,null,0,null,0]
[null,"Reference year (r):",null,null,null,null,2005,null,2005,null,2005,null,2005,null,2005,null,2005]
[null,"Predicted average crash freq. for reference year (Np,w,x,sv,pdo,r), crashes/yr:",null,null,null,null,0.16071788966655731,null,8.0048501491546631E-2,null,0.15196479856967926,null,5.2705265581607819E-2,null,0.1051177904009819,null,0.14043661952018738]
[null,"Equivalent years associated with crash count (Cb,w,x,sv,pdo,r), yr:",null,null,null,null,3.0731563568115234,null,3,null,3.0237960815429688,null,3,null,3,null,3]
[null,"Expected average crash freq. for reference year given N*o (Na,w,x,sv,pdo,r), crashes/yr:",null,null,null,null,0.13175764679908752,null,5.678548663854599E-2,null,0.24896050989627838,null,7.5855135917663574E-2,null,7.9467490315437317E-2,null,0.11552730947732925]
[null,{"$f":"IF(Main!$AG$14=TRUE, \"Expected average crash frequency\", \"Predicted average crash frequency\")","v":"Expected average crash frequency"},null,null,null,{"$f":"F187","v":2005},0.13175764679908752,null,5.678548663854599E-2,null,0.24896050989627838,null,7.5855135917663574E-2,null,7.9467490315437317E-2,null,0.11552730947732925]
[null,"  (Ne,w,x,sv,pdo), crashes/yr:","(Np,w,x,sv,pdo), crashes/yr:",null,null,{"$f":"F188","v":2006},0.13498207926750183,null,5.678548663854599E-2,null,0.24896050989627838,null,7.5855135917663574E-2,null,7.9467490315437317E-2,null,0.11552730947732925]
[null,null,null,null,null,2007,0.13817211985588074,null,5.678548663854599E-2,null,0.25488480925559998,null,7.5855135917663574E-2,null,7.9467490315437317E-2,null,0.11552730947732925]
[null,null,null,null,null,2008]
[null,null,null,null,null,2009]
[null,null,null,null,null,2010]
[null,null,null,null,null,2011]
[null,null,null,null,null,2012]
[null,null,null,null,null,2013,null,0.14887224137783051,null,5.678548663854599E-2,null,0.28922396898269653,null,7.5855135917663574E-2,null,7.9467490315437317E-2,null,0.11552730947732925]
[null,null,null,null,null,2014,null,0.15061657130718231,null,5.678548663854599E-2,null,0.29476639628410339,null,7.5855135917663574E-2,null,7.9467490315437317E-2,null,0.11552730947732925]
[null,null,null,null,null,2015,null,0.15061657130718231,null,5.678548663854599E-2,null,0.29476639628410339,null,7.5855135917663574E-2,null,7.9467490315437317E-2,null,0.11552730947732925]
[null,null,null,null,null,2016]
[null,null,null,null,null,2017]
[null,null,null,null,null,2018]
[null,null,null,null,null,2019]
[null,null,null,null,null,2020]
[null,null,null,null,null,2021]
[null,null,null,null,null,2022]
[null,null,null,null,null,2023]
[null,null,null,null,null,2024]
[null,null,null,null,null,2025]
[null,null,null,null,null,2026]
[null,null,null,null,null,2027]
[null,null,null,null,null,2028]
[null,"Project Level Crash Analysis",null,null,null,"Year","Project"]
[null,"Observed crash count (N*o,aS,ac,at,pdo), crashes:"]
[null,"Reference year (r):"]
[null,"Predicted average crash freq. for reference year (Np,aS,ac,at,pdo,r), crashes/yr:"]
[null,"Equivalent years associated with crash count (Cb,aS,ac,at,pdo,r), yr:"]
[null,"Independent sites crash analysis"]
[null,"   Variance when site crash frequencies are independent (V0,aS,ac,at,pdo):"]
[null,"   Weight associated with Np,...r (w0,aS,ac,at,pdo):"]
[null,"   Expected average crash freq. for reference year given N*o (N0,aS,ac,at,pdo,r), crashes/yr:"]
[null,"Correlated sites crash analysis"]
[null,"   Variance when site crash frequencies are correlated (V1,aS,ac,at,pdo):"]
[null,"   Weight associated with Np,...r (w1,aS,ac,at,pdo):"]
[null,"   Expected average crash freq. for reference year given N*o (N1,aS,ac,at,pdo,r), crashes/yr:"]
[null,"Expected average crash frequency",null,null,null,{"$f":"F218","v":2005}]
[null,"  (Ne,aS,ac,at,pdo), crashes/year:",null,null,null,{"$f":"F219","v":2006}]
[null,null,null,null,null,2007]
[null,null,null,null,null,2008]
[null,null,null,null,null,2009]
[null,null,null,null,null,2010]
[null,null,null,null,null,2011]
[null,null,null,null,null,2012]
[null,null,null,null,null,2013]
[null,null,null,null,null,2014]
[null,null,null,null,null,2015]
[null,null,null,null,null,2016]
[null,null,null,null,null,2017]
[null,null,null,null,null,2018]
[null,null,null,null,null,2019]
[null,null,null,null,null,2020]
[null,null,null,null,null,2021]
[null,null,null,null,null,2022]
[null,null,null,null,null,2023]
[null,null,null,null,null,2024]
[null,null,null,null,null,2025]
[null,null,null,null,null,2026]
[null,null,null,null,null,2027]
[null,null,null,null,null,2028]
[null,"Crash Severity Distribution",null,null,{"$f":"IF(Main!$AG$15=TRUE, \"Project Study Period\", \"\")","v":""}]
[null," (during Study Period)"]
[null,"Fatal crash frequency (N*e,w,x,at,K), crashes:",null,null,null,null,null,8.8195465505123138E-3,null,3.1476619187742472E-3,null,1.0827038437128067E-2,null,7.5939358212053776E-3,null,6.5490994602441788E-3,null,7.211269810795784E-3]
[null,"Incapacitating injury crash freq. (N*e,w,x,at,A), crashes:",null,null,null,null,null,2.6743138208985329E-2,null,9.5445234328508377E-3,null,3.2830372452735901E-2,null,2.302677184343338E-2,null,1.9858559593558311E-2,null,2.1866427734494209E-2]
[null,"Non-incapacitating inj. crash freq. (N*e,w,x,at,B), crashes:",null,null,null,null,null,9.2493116855621338E-2,null,3.3618524670600891E-2,null,0.1711752712726593,null,0.14656610786914825,null,8.2554124295711517E-2,null,0.13918048143386841]
[null,"Possible injury crash freq. (N*e,w,x,at,C), crashes:",null,null,null,null,null,0.21270604431629181,null,9.0464532375335693E-2,null,0.34442213177680969,null,0.1789267510175705,null,0.10078142583370209,null,0.16991044580936432]
[null,"  Total fatal-and-injury crash freq. (N*e,w,x,at,fi), crashes:",null,null,null,null,null,0.34076187014579773,null,0.13677524030208588,null,0.55925482511520386,null,0.35611358284950256,null,0.2097432017326355,null,0.33816862106323242]
[null,"Property-damage-only crash freq. (N*e,w,x,at,pdo), crashes:",null,null,null,null,null,0.51333314180374146,null,0.1882271021604538,null,1.0872931480407715,null,0.48373594880104065,null,0.25684836506843567,null,0.44301652908325195]
[null,"  Total crash frequency (N*e,w,x,at,as), crashes:",null,null,null,null,null,0.8540949821472168,null,0.32500234246253967,null,1.6465480327606201,null,0.83984953165054321,null,0.46659156680107117,null,0.78118515014648438]
[null,"Intermediate Results"]
[null,"Friction-limited curve speed for curve 1 (vmax,1), ft/s:",null,null,null,null,107.02035522460938,107.02035522460938,107.02035522460938,107.02035522460938,59.972629547119141,59.972629547119141,null,null,72.929252624511719,72.929252624511719,59.236961364746094,59.236961364746094]
[null,"   Curve entry speed for curve 1 (vent,1), ft/s:",null,null,null,null,93.92041015625,93.92041015625,93.92041015625,93.92041015625,44.668972015380859,44.668972015380859,null,null,81.348983764648438,81.348983764648438,39.789047241210938,39.789047241210938]
[null,"   Curve exit speed for curve 1 (vext,1), ft/s:",null,null,null,null,75.757209777832031,75.757209777832031,75.757209777832031,75.757209777832031,59.570354461669922,59.570354461669922,null,null,63.538860321044922,63.538860321044922,57.75274658203125,57.75274658203125]
[null,"   Proportion of segment length with curve 1 (Pc,1):",null,null,null,null,0.22233042120933533,0.22233042120933533,null,null,0.23390001058578491,0.23390001058578491,null,null,null,null,0.24800001084804535,0.24800001084804535]
[null,"Friction-limited curve speed for curve 2 (vmax,2), ft/s:",null,null,null,null,null,null,65.808090209960938,65.808090209960938,89.651527404785156,89.651527404785156,null,null,59.236961364746094,59.236961364746094,72.929252624511719,72.929252624511719]
[null,"   Curve entry speed for curve 2 (vent,2), ft/s:",null,null,null,null,null,null,59.438777923583984,59.438777923583984,64.798652648925781,64.798652648925781,null,null,58.002044677734375,58.002044677734375,64.798652648925781,64.798652648925781]
[null,"   Curve exit speed for curve 2 (vext,2), ft/s:",null,null,null,null,null,null,44.099998474121094,44.099998474121094,80.008651733398438,80.008651733398438,null,null,49.094287872314453,49.094287872314453,72.929252624511719,72.929252624511719]
[null,"   Proportion of segment length with curve 2 (Pc,2):",null,null,null,null,null,null,0.83333337306976318,0.83333337306976318,0.45929998159408569,0.45929998159408569,null,null,0.4960000216960907,0.4960000216960907,0.49584999680519104,0.49584999680519104]
[null,"Friction-limited curve speed for curve 3 (vmax,3), ft/s:"]
[null,"   Curve entry speed for curve 3 (vent,3), ft/s:"]
[null,"   Curve exit speed for curve 3 (vext,3), ft/s:"]
[null,"   Proportion of segment length with curve 3 (Pc,3):"]
[null,"Friction-limited curve speed for curve 4 (vmax,4), ft/s:"]
[null,"   Curve entry speed for curve 4 (vent,4), ft/s:"]
[null,"   Curve exit speed for curve 4 (vext,4), ft/s:"]
[null,"   Proportion of segment length with curve 4 (Pc,4):"]
[null,"Friction-limited curve speed for curve 5 (vmax,5), ft/s:"]
[null,"   Curve entry speed for curve 5 (vent,5), ft/s:"]
[null,"   Curve exit speed for curve 5 (vext,5), ft/s:"]
[null,"   Proportion of segment length with curve 5 (Pc,5):"]
[null,"Distance from edge of right shoulder to barrier face (Wrcb), ft:",null,null,null,null,1.3000001907348633,1.3000001907348633,1,1,999,999,999,999,999,999,999,999]
[null,"Proportion of segment length with barrier on the right side (Prb):",null,null,null,null,0.90565210580825806,0.90565210580825806,0.84666669368743896,0.84666669368743896,0,0,0,0,0,0,0,0]
[null,"Distance from edge of left shoulder to barrier face (Wlcb), ft:",null,null,null,null,2.8000001907348633,2.8000001907348633,1,1,2.3999998569488525,2.3999998569488525,999,999,999,999,999,999]
[null,"Proportion of segment length with barrier on the left side (Plb):",null,null,null,null,1.4000000432133675E-2,1.4000000432133675E-2,0.80166667699813843,0.80166667699813843,0.29999998211860657,0.29999998211860657,0,0,0,0,0,0]
[null,"Proportion of segment length within a weaving section (Pwev):",null,null,null,null,0,0,0,0,0,0,0.83333331346511841,0.83333331346511841,0,0,0,0]
[null,"Proportion of segment length adjacent to speed-change lane of another ramp (Pen-ex):",null,null,null,null,0.10291303694248199,0.10291303694248199,0,0,0.37880000472068787,0.37880000472068787,0,0,0,0,0,0]
[null,"Proportion of segment length adjacent to taper of lane add or drop. (Ptpr):",null,null,null,null,0,0,0.31566667556762695,0.31566667556762695,0.23675000667572021,0.23675000667572021,0,0,0,0,0,0]
[null,"Traffic Data",null,null,null,"Year"]
[null,"Average daily traffic (AADTr or AADTc) by year, veh/d:",null,null,null,{"$f":"Main!AG5","v":2005},2800,null,2900,null,3600,null,4500,null,5000,null,5000]
[null,null,null,null,null,{"$f":"F317+1","v":2006},2900,null,2900,null,3600,null,4500,null,5000,null,5000]
[null,null,null,null,null,{"$f":"F318+1","v":2007},3000,null,2900,null,3725,null,4500,null,5000,null,5000]
[null,null,null,null,null,2008,3057,null,2900,null,3850,null,4500,null,5000,null,5000]
[null,null,null,null,null,2009,3114,null,2900,null,3975,null,4500,null,5000,null,5000]
[null,null,null,null,null,2010,3171,null,2900,null,4100,null,4500,null,5000,null,5000]
[null,null,null,null,null,2011,3229,null,2900,null,4225,null,4500,null,5000,null,5000]
[null,null,null,null,null,2012,3286,null,2900,null,4350,null,4500,null,5000,null,5000]
[null,null,null,null,null,2013,3343,null,2900,null,4475,null,4500,null,5000,null,5000]
[null,null,null,null,null,2014,3400,null,2900,null,4600,null,4500,null,5000,null,5000]
[null,null,null,null,null,2015,3400,null,2900,null,4600,null,4500,null,5000,null,5000]
[null,null,null,null,null,2016,3400,null,2900,null,4600,null,4500,null,5000,null,5000]
[null,null,null,null,null,2017,3400,null,2900,null,4600,null,4500,null,5000,null,5000]
[null,null,null,null,null,2018,3400,null,2900,null,4600,null,4500,null,5000,null,5000]
[null,null,null,null,null,2019,3400,null,2900,null,4600,null,4500,null,5000,null,5000]
[null,null,null,null,null,2020,3400,null,2900,null,4600,null,4500,null,5000,null,5000]
[null,null,null,null,null,2021,3400,null,2900,null,4600,null,4500,null,5000,null,5000]
[null,null,null,null,null,2022,3400,null,2900,null,4600,null,4500,null,5000,null,5000]
[null,null,null,null,null,2023,3400,null,2900,null,4600,null,4500,null,5000,null,5000]
[null,null,null,null,null,2024,3400,null,2900,null,4600,null,4500,null,5000,null,5000]
[null,null,null,null,null,2025,3400,null,2900,null,4600,null,4500,null,5000,null,5000]
[null,null,null,null,null,2026,3400,null,2900,null,4600,null,4500,null,5000,null,5000]
[null,null,null,null,null,2027,3400,null,2900,null,4600,null,4500,null,5000,null,5000]
[null,null,null,null,null,2028,3400,null,2900,null,4600,null,4500,null,5000,null,5000]

{"sheet":"Output Ramp Terminals","index":9,"n_rows":756,"n_cols":18,"rows_kept":756,"cut":false,"hidden":false,"merged":[[561,4,561,5],[557,4,557,5],[558,4,558,5],[559,4,559,5],[560,4,560,5],[4,17,5,17],[553,4,554,5],[555,4,555,5],[556,4,556,5],[4,13,5,13],[4,14,5,14],[4,15,5,15],[4,16,5,16],[4,9,5,9],[4,10,5,10],[4,11,5,11],[4,12,5,12],[4,4,5,5],[4,6,5,6],[4,7,5,7],[4,8,5,8]]}
[]
[]
[null,null,null,null,"Output Worksheet for Crossroad Ramp Terminals"]
[null,"   Signal = signalized intersection model",null,null,null,null,{"$f":"\"Terminal \"& TEXT(INT((COLUMN()-5)/2),\"0\")","v":"Terminal 1"},null,{"$f":"\"Terminal \"& TEXT(INT((COLUMN()-5)/2),\"0\")","v":"Terminal 2"},null,{"$f":"\"Terminal \"& TEXT(INT((COLUMN()-5)/2),\"0\")","v":"Terminal 3"},null,{"$f":"\"Terminal \"& TEXT(INT((COLUMN()-5)/2),\"0\")","v":"Terminal 4"},null,{"$f":"\"Terminal \"& TEXT(INT((COLUMN()-5)/2),\"0\")","v":"Terminal 5"},null,{"$f":"\"Terminal \"& TEXT(INT((COLUMN()-5)/2),\"0\")","v":"Terminal 6"}]
[null,"   Unsig = unsignalized intersection model",null,null,"Applicable Models",null,{"$f":"IF(Main!$AK$14=TRUE, \"Crash Period\", \"Study Period\")","v":"Crash Period"},{"$f":"IF(Main!$AK$14=TRUE, \"Study Period\", \"\")","v":"Study Period"},{"$f":"G5","v":"Crash Period"},"Study Period","Crash Period","Study Period","Crash Period","Study Period","Crash Period","Study Period","Crash Period","Study Period"]
[]
[null,"Crash Modification Factors"]
[null,"Fatal-and-Injury Crash CMFs"]
[null,"Non-ramp public street leg (CMF19,w,SG,at,fi):",null,null,"Signal",null,1,1,null,null,null,null,null,null,null,null,1,1]
[null,"Segment length (CMF14,w,x,at,fi):",null,null,"Signal","Unsig",0.75567108392715454,0.75567108392715454,0.82056164741516113,0.82056164741516113,0.89222091436386108,0.89222091436386108,0.82959020137786865,0.82959020137786865,0.8179699182510376,0.8179699182510376,0.70516061782836914,0.70516061782836914]
[null,"Protected left-turn operation (CMF16,w,SG,at,fi):",null,null,"Signal"]
[null,null,null,null,"Year:",{"$f":"Main!$AK$5","v":2005},0.57178127765655518,0.57178127765655518,null,null,null,null,null,null,null,null,1,1]
[null,null,null,null,null,{"$f":"F12+1","v":2006},0.57169795036315918,0.57169795036315918,null,null,null,null,null,null,null,null,1,1]
[null,null,null,null,null,{"$f":"F13+1","v":2007},0.57161629199981689,0.57161629199981689,null,null,null,null,null,null,null,null,1,1]
[null,null,null,null,null,2008]
[null,null,null,null,null,2009]
[null,null,null,null,null,2010]
[null,null,null,null,null,2011]
[null,null,null,null,null,2012]
[null,null,null,null,null,2013,0.5703851580619812,0.5703851580619812,null,null,null,null,null,null,null,null,1,1]
[null,null,null,null,null,2014,0.57018309831619263,0.57018309831619263,null,null,null,null,null,null,null,null,1,1]
[null,null,null,null,null,2015,0.57018309831619263,0.57018309831619263,null,null,null,null,null,null,null,null,1,1]
[null,null,null,null,null,2016]
[null,null,null,null,null,2017]
[null,null,null,null,null,2018]
[null,null,null,null,null,2019]
[null,null,null,null,null,2020]
[null,null,null,null,null,2021]
[null,null,null,null,null,2022]
[null,null,null,null,null,2023]
[null,null,null,null,null,2024]
[null,null,null,null,null,2025]
[null,null,null,null,null,2026]
[null,null,null,null,null,2027]
[null,null,null,null,null,2028]
[null,"Channelized right turn on crossroad (CMF17,w,SG,at,fi):",null,null,"Signal"]
[null,null,null,null,"Year:",{"$f":"Main!$AK$5","v":2005},1.2462356090545654,1.2462356090545654,null,null,null,null,null,null,null,null,1,1]
[null,null,null,null,null,{"$f":"F37+1","v":2006},1.2462834119796753,1.2462834119796753,null,null,null,null,null,null,null,null,1,1]
[null,null,null,null,null,{"$f":"F38+1","v":2007},1.2463303804397583,1.2463303804397583,null,null,null,null,null,null,null,null,1,1]
[null,null,null,null,null,2008]
[null,null,null,null,null,2009]
[null,null,null,null,null,2010]
[null,null,null,null,null,2011]
[null,null,null,null,null,2012]
[null,null,null,null,null,2013,1.2428754568099976,1.2428754568099976,null,null,null,null,null,null,null,null,1,1]
[null,null,null,null,null,2014,1.2423083782196045,1.2423083782196045,null,null,null,null,null,null,null,null,1,1]
[null,null,null,null,null,2015,1.2423083782196045,1.2423083782196045,null,null,null,null,null,null,null,null,1,1]
[null,null,null,null,null,2016]
[null,null,null,null,null,2017]
[null,null,null,null,null,2018]
[null,null,null,null,null,2019]
[null,null,null,null,null,2020]
[null,null,null,null,null,2021]
[null,null,null,null,null,2022]
[null,null,null,null,null,2023]
[null,null,null,null,null,2024]
[null,null,null,null,null,2025]
[null,null,null,null,null,2026]
[null,null,null,null,null,2027]
[null,null,null,null,null,2028]
[null,"Channelized right turn on exit ramp (CMF18,w,SG,at,fi):",null,null,"Signal"]
[null,null,null,null,"Year:",{"$f":"Main!$AK$5","v":2005},1,1,null,null,null,null,null,null,null,null,1.0780231952667236,1.0780231952667236]
[null,null,null,null,null,{"$f":"F62+1","v":2006},1,1,null,null,null,null,null,null,null,null,1.0780231952667236,1.0780231952667236]
[null,null,null,null,null,{"$f":"F63+1","v":2007},1,1,null,null,null,null,null,null,null,null,1.0780231952667236,1.0780231952667236]
[null,null,null,null,null,2008]
[null,null,null,null,null,2009]
[null,null,null,null,null,2010]
[null,null,null,null,null,2011]
[null,null,null,null,null,2012]
[null,null,null,null,null,2013,1,1,null,null,null,null,null,null,null,null,1.0780231952667236,1.0780231952667236]
[null,null,null,null,null,2014,1,1,null,null,null,null,null,null,null,null,1.0780231952667236,1.0780231952667236]
[null,null,null,null,null,2015,1,1,null,null,null,null,null,null,null,null,1.0780231952667236,1.0780231952667236]
[null,null,null,null,null,2016]
[null,null,null,null,null,2017]
[null,null,null,null,null,2018]
[null,null,null,null,null,2019]
[null,null,null,null,null,2020]
[null,null,null,null,null,2021]
[null,null,null,null,null,2022]
[null,null,null,null,null,2023]
[null,null,null,null,null,2024]
[null,null,null,null,null,2025]
[null,null,null,null,null,2026]
[null,null,null,null,null,2027]
[null,null,null,null,null,2028]
[null,"Access point frequency (CMF13,w,x,at,fi):",null,null,"Signal","Unsig"]
[null,null,null,null,"Year:",{"$f":"Main!$AK$5","v":2005},1.0710018873214722,1.0710018873214722,1,1,1,1,1,1,1,1,1.2569984197616577,1.2569984197616577]
[null,null,null,null,null,{"$f":"F87+1","v":2006},1.0710157155990601,1.0710157155990601,1,1,1,1,1,1,1,1,1.2569984197616577,1.2569984197616577]
[null,null,null,null,null,{"$f":"F88+1","v":2007},1.0710291862487793,1.0710291862487793,1,1,1,1,1,1,1,1,1.2569984197616577,1.2569984197616577]
[null,null,null,null,null,2008]
[null,null,null,null,null,2009]
[null,null,null,null,null,2010]
[null,null,null,null,null,2011]
[null,null,null,null,null,2012]
[null,null,null,null,null,2013,1.0700329542160034,1.0700329542160034,1,1,1,1,1,1,1,1,1.2569984197616577,1.2569984197616577]
[null,null,null,null,null,2014,1.0698693990707397,1.0698693990707397,1,1,1,1,1,1,1,1,1.2569984197616577,1.2569984197616577]
[null,null,null,null,null,2015,1.0698693990707397,1.0698693990707397,1,1,1,1,1,1,1,1,1.2569984197616577,1.2569984197616577]
[null,null,null,null,null,2016]
[null,null,null,null,null,2017]
[null,null,null,null,null,2018]
[null,null,null,null,null,2019]
[null,null,null,null,null,2020]
[null,null,null,null,null,2021]
[null,null,null,null,null,2022]
[null,null,null,null,null,2023]
[null,null,null,null,null,2024]
[null,null,null,null,null,2025]
[null,null,null,null,null,2026]
[null,null,null,null,null,2027]
[null,null,null,null,null,2028]
[null,"Crossroad left-turn lane (CMF11,w,x,at,fi):",null,null,"Signal","Unsig"]
[null,null,null,null,"Year:",{"$f":"Main!$AK$5","v":2005},0.85481566190719604,0.85481566190719604,0.84787791967391968,0.84787791967391968,1,1,null,null,0.84955286979675293,0.84955286979675293,1,1]
[null,null,null,null,null,{"$f":"F112+1","v":2006},0.85478740930557251,0.85478740930557251,0.84799903631210327,0.84799903631210327,1,1,null,null,0.84955286979675293,0.84955286979675293,1,1]
[null,null,null,null,null,{"$f":"F113+1","v":2007},0.85475975275039673,0.85475975275039673,0.8477938175201416,0.8477938175201416,1,1,null,null,0.84955286979675293,0.84955286979675293,1,1]
[null,null,null,null,null,2008]
[null,null,null,null,null,2009]
[null,null,null,null,null,2010]
[null,null,null,null,null,2011]
[null,null,null,null,null,2012]
[null,null,null,null,null,2013,0.85188782215118408,0.85188782215118408,0.8477938175201416,0.8477938175201416,1,1,null,null,0.84955286979675293,0.84955286979675293,1,1]
[null,null,null,null,null,2014,0.85141646862030029,0.85141646862030029,0.8477938175201416,0.8477938175201416,1,1,null,null,0.84955286979675293,0.84955286979675293,1,1]
[null,null,null,null,null,2015,0.85141646862030029,0.85141646862030029,0.8477938175201416,0.8477938175201416,1,1,null,null,0.84955286979675293,0.84955286979675293,1,1]
[null,null,null,null,null,2016]
[null,null,null,null,null,2017]
[null,null,null,null,null,2018]
[null,null,null,null,null,2019]
[null,null,null,null,null,2020]
[null,null,null,null,null,2021]
[null,null,null,null,null,2022]
[null,null,null,null,null,2023]
[null,null,null,null,null,2024]
[null,null,null,null,null,2025]
[null,null,null,null,null,2026]
[null,null,null,null,null,2027]
[null,null,null,null,null,2028]
[null,"Crossroad right-turn lane (CMF12,w,x,at,fi):",null,null,"Signal","Unsig"]
[null,null,null,null,"Year:",{"$f":"Main!$AK$5","v":2005},0.90044504404067993,0.90044504404067993,0.95176619291305542,0.95176619291305542,1,1,null,null,1,1,0.80691909790039063,0.80691909790039063]
[null,null,null,null,null,{"$f":"F137+1","v":2006},0.90042567253112793,0.90042567253112793,0.95170110464096069,0.95170110464096069,1,1,null,null,1,1,0.80691909790039063,0.80691909790039063]
[null,null,null,null,null,{"$f":"F138+1","v":2007},0.90040665864944458,0.90040665864944458,0.95173949003219604,0.95173949003219604,1,1,null,null,1,1,0.80691909790039063,0.80691909790039063]
[null,null,null,null,null,2008]
[null,null,null,null,null,2009]
[null,null,null,null,null,2010]
[null,null,null,null,null,2011]
[null,null,null,null,null,2012]
[null,null,null,null,null,2013,0.90180355310440063,0.90180355310440063,0.95173949003219604,0.95173949003219604,1,1,null,null,1,1,0.80691909790039063,0.80691909790039063]
[null,null,null,null,null,2014,0.90203279256820679,0.90203279256820679,0.95173949003219604,0.95173949003219604,1,1,null,null,1,1,0.80691909790039063,0.80691909790039063]
[null,null,null,null,null,2015,0.90203279256820679,0.90203279256820679,0.95173949003219604,0.95173949003219604,1,1,null,null,1,1,0.80691909790039063,0.80691909790039063]
[null,null,null,null,null,2016]
[null,null,null,null,null,2017]
[null,null,null,null,null,2018]
[null,null,null,null,null,2019]
[null,null,null,null,null,2020]
[null,null,null,null,null,2021]
[null,null,null,null,null,2022]
[null,null,null,null,null,2023]
[null,null,null,null,null,2024]
[null,null,null,null,null,2025]
[null,null,null,null,null,2026]
[null,null,null,null,null,2027]
[null,null,null,null,null,2028]
[null,"Median width (CMF15,w,x,at,fi):",null,null,"Signal","Unsig"]
[null,null,null,null,"Year:",{"$f":"Main!$AK$5","v":2005},1,1,0.98361629247665405,0.98361629247665405,0.97701865434646606,0.97701865434646606,1,1,1,1,1,1]
[null,null,null,null,null,{"$f":"F162+1","v":2006},1,1,0.9836692214012146,0.9836692214012146,0.97701865434646606,0.97701865434646606,1,1,1,1,1,1]
[null,null,null,null,null,{"$f":"F163+1","v":2007},1,1,0.9837220311164856,0.9837220311164856,0.97701865434646606,0.97701865434646606,1,1,1,1,1,1]
[null,null,null,null,null,2008]
[null,null,null,null,null,2009]
[null,null,null,null,null,2010]
[null,null,null,null,null,2011]
[null,null,null,null,null,2012]
[null,null,null,null,null,2013,1,1,0.9837220311164856,0.9837220311164856,0.97701865434646606,0.97701865434646606,1,1,1,1,1,1]
[null,null,null,null,null,2014,1,1,0.9837220311164856,0.9837220311164856,0.97701865434646606,0.97701865434646606,1,1,1,1,1,1]
[null,null,null,null,null,2015,1,1,0.9837220311164856,0.9837220311164856,0.97701865434646606,0.97701865434646606,1,1,1,1,1,1]
[null,null,null,null,null,2016]
[null,null,null,null,null,2017]
[null,null,null,null,null,2018]
[null,null,null,null,null,2019]
[null,null,null,null,null,2020]
[null,null,null,null,null,2021]
[null,null,null,null,null,2022]
[null,null,null,null,null,2023]
[null,null,null,null,null,2024]
[null,null,null,null,null,2025]
[null,null,null,null,null,2026]
[null,null,null,null,null,2027]
[null,null,null,null,null,2028]
[null,"Exit ramp capacity (CMF10,w,x,at,fi):",null,null,"Signal","Unsig"]
[null,null,null,null,"Year:",{"$f":"Main!$AK$5","v":2005},1.0800570249557495,1.0800570249557495,1.0117990970611572,1.0117990970611572,1.1804715394973755,1.1804715394973755,1.0273574590682983,1.0273574590682983,1.0528857707977295,1.0528857707977295,1.0085402727127075,1.0085402727127075]
[null,null,null,null,null,{"$f":"F187+1","v":2006},1.0799812078475952,1.0799812078475952,1.0117896795272827,1.0117896795272827,1.1804715394973755,1.1804715394973755,1.0273574590682983,1.0273574590682983,1.0528857707977295,1.0528857707977295,1.0085402727127075,1.0085402727127075]
[null,null,null,null,null,{"$f":"F188+1","v":2007},1.0799068212509155,1.0799068212509155,1.0117802619934082,1.0117802619934082,1.1804715394973755,1.1804715394973755,1.0273574590682983,1.0273574590682983,1.0528857707977295,1.0528857707977295,1.0085402727127075,1.0085402727127075]
[null,null,null,null,null,2008]
[null,null,null,null,null,2009]
[null,null,null,null,null,2010]
[null,null,null,null,null,2011]
[null,null,null,null,null,2012]
[null,null,null,null,null,2013,1.0787861347198486,1.0787861347198486,1.0117802619934082,1.0117802619934082,1.1804715394973755,1.1804715394973755,1.0273574590682983,1.0273574590682983,1.0528857707977295,1.0528857707977295,1.0085402727127075,1.0085402727127075]
[null,null,null,null,null,2014,1.0786021947860718,1.0786021947860718,1.0117802619934082,1.0117802619934082,1.1804715394973755,1.1804715394973755,1.0273574590682983,1.0273574590682983,1.0528857707977295,1.0528857707977295,1.0085402727127075,1.0085402727127075]
[null,null,null,null,null,2015,1.0786021947860718,1.0786021947860718,1.0117802619934082,1.0117802619934082,1.1804715394973755,1.1804715394973755,1.0273574590682983,1.0273574590682983,1.0528857707977295,1.0528857707977295,1.0085402727127075,1.0085402727127075]
[null,null,null,null,null,2016]
[null,null,null,null,null,2017]
[null,null,null,null,null,2018]
[null,null,null,null,null,2019]
[null,null,null,null,null,2020]
[null,null,null,null,null,2021]
[null,null,null,null,null,2022]
[null,null,null,null,null,2023]
[null,null,null,null,null,2024]
[null,null,null,null,null,2025]
[null,null,null,null,null,2026]
[null,null,null,null,null,2027]
[null,null,null,null,null,2028]
[null,"Skew angle (CMF20,w,ST,at,fi):",null,null,null,"Unsig"]
[null,null,null,null,"Year:",{"$f":"Main!$AK$5","v":2005},null,null,1.0002058744430542,1.0002058744430542,1.0391180515289307,1.0391180515289307,null,null,1.0455639362335205,1.0455639362335205]
[null,null,null,null,null,{"$f":"F212+1","v":2006},null,null,1.0002056360244751,1.0002056360244751,1.0391180515289307,1.0391180515289307,null,null,1.0455639362335205,1.0455639362335205]
[null,null,null,null,null,{"$f":"F213+1","v":2007},null,null,1.0002055168151855,1.0002055168151855,1.0391180515289307,1.0391180515289307,null,null,1.0455639362335205,1.0455639362335205]
[null,null,null,null,null,2008]
[null,null,null,null,null,2009]
[null,null,null,null,null,2010]
[null,null,null,null,null,2011]
[null,null,null,null,null,2012]
[null,null,null,null,null,2013,null,null,1.0002055168151855,1.0002055168151855,1.0391180515289307,1.0391180515289307,null,null,1.0455639362335205,1.0455639362335205]
[null,null,null,null,null,2014,null,null,1.0002055168151855,1.0002055168151855,1.0391180515289307,1.0391180515289307,null,null,1.0455639362335205,1.0455639362335205]
[null,null,null,null,null,2015,null,null,1.0002055168151855,1.0002055168151855,1.0391180515289307,1.0391180515289307,null,null,1.0455639362335205,1.0455639362335205]
[null,null,null,null,null,2016]
[null,null,null,null,null,2017]
[null,null,null,null,null,2018]
[null,null,null,null,null,2019]
[null,null,null,null,null,2020]
[null,null,null,null,null,2021]
[null,null,null,null,null,2022]
[null,null,null,null,null,2023]
[null,null,null,null,null,2024]
[null,null,null,null,null,2025]
[null,null,null,null,null,2026]
[null,null,null,null,null,2027]
[null,null,null,null,null,2028]
[null,"All-way stop control (CMFawsc):",null,null,null,"Unsig",null,null,null,null,null,null,0.68591606616973877,0.68591606616973877]
[null,"Property-Damage-Only Crash CMFs"]
[null,"Non-ramp public street leg (CMF19,w,SG,at,pdo):",null,null,"Signal",null,1,1,null,null,null,null,null,null,null,null,1,1]
[null,"Segment length (CMF14,w,x,at,pdo):",null,null,"Signal",null,0.75452762842178345,0.75452762842178345,null,null,null,null,null,null,null,null,0.70383036136627197,0.70383036136627197]
[null,"Protected left-turn operation (CMF16,w,SG,at,pdo):",null,null,"Signal"]
[null,null,null,null,"Year:",{"$f":"Main!$AK$5","v":2005},0.70148754119873047,0.70148754119873047,null,null,null,null,null,null,null,null,1,1]
[null,null,null,null,null,{"$f":"F241+1","v":2006},0.70142948627471924,0.70142948627471924,null,null,null,null,null,null,null,null,1,1]
[null,null,null,null,null,{"$f":"F242+1","v":2007},0.70137256383895874,0.70137256383895874,null,null,null,null,null,null,null,null,1,1]
[null,null,null,null,null,2008]
[null,null,null,null,null,2009]
[null,null,null,null,null,2010]
[null,null,null,null,null,2011]
[null,null,null,null,null,2012]
[null,null,null,null,null,2013,0.70051431655883789,0.70051431655883789,null,null,null,null,null,null,null,null,1,1]
[null,null,null,null,null,2014,0.70037347078323364,0.70037347078323364,null,null,null,null,null,null,null,null,1,1]
[null,null,null,null,null,2015,0.70037347078323364,0.70037347078323364,null,null,null,null,null,null,null,null,1,1]
[null,null,null,null,null,2016]
[null,null,null,null,null,2017]
[null,null,null,null,null,2018]
[null,null,null,null,null,2019]
[null,null,null,null,null,2020]
[null,null,null,null,null,2021]
[null,null,null,null,null,2022]
[null,null,null,null,null,2023]
[null,null,null,null,null,2024]
[null,null,null,null,null,2025]
[null,null,null,null,null,2026]
[null,null,null,null,null,2027]
[null,null,null,null,null,2028]
[null,"Channelized right turn on crossroad (CMF17,w,SG,at,pdo):",null,null,"Signal"]
[null,null,null,null,"Year:",{"$f":"Main!$AK$5","v":2005},1.2455748319625854,1.2455748319625854,null,null,null,null,null,null,null,null,1,1]
[null,null,null,null,null,{"$f":"F266+1","v":2006},1.2456226348876953,1.2456226348876953,null,null,null,null,null,null,null,null,1,1]
[null,null,null,null,null,{"$f":"F267+1","v":2007},1.2456693649291992,1.2456693649291992,null,null,null,null,null,null,null,null,1,1]
[null,null,null,null,null,2008]
[null,null,null,null,null,2009]
[null,null,null,null,null,2010]
[null,null,null,null,null,2011]
[null,null,null,null,null,2012]
[null,null,null,null,null,2013,1.2422237396240234,1.2422237396240234,null,null,null,null,null,null,null,null,1,1]
[null,null,null,null,null,2014,1.2416582107543945,1.2416582107543945,null,null,null,null,null,null,null,null,1,1]
[null,null,null,null,null,2015,1.2416582107543945,1.2416582107543945,null,null,null,null,null,null,null,null,1,1]
[null,null,null,null,null,2016]
[null,null,null,null,null,2017]
[null,null,null,null,null,2018]
[null,null,null,null,null,2019]
[null,null,null,null,null,2020]
[null,null,null,null,null,2021]
[null,null,null,null,null,2022]
[null,null,null,null,null,2023]
[null,null,null,null,null,2024]
[null,null,null,null,null,2025]
[null,null,null,null,null,2026]
[null,null,null,null,null,2027]
[null,null,null,null,null,2028]
[null,"Channelized right turn on exit ramp (CMF18,w,SG,at,pdo):",null,null,"Signal"]
[null,null,null,null,"Year:",{"$f":"Main!$AK$5","v":2005},1,1,null,null,null,null,null,null,null,null,1.1459879875183105,1.1459879875183105]
[null,null,null,null,null,{"$f":"F291+1","v":2006},1,1,null,null,null,null,null,null,null,null,1.1459879875183105,1.1459879875183105]
[null,null,null,null,null,{"$f":"F292+1","v":2007},1,1,null,null,null,null,null,null,null,null,1.1459879875183105,1.1459879875183105]
[null,null,null,null,null,2008]
[null,null,null,null,null,2009]
[null,null,null,null,null,2010]
[null,null,null,null,null,2011]
[null,null,null,null,null,2012]
[null,null,null,null,null,2013,1,1,null,null,null,null,null,null,null,null,1.1459879875183105,1.1459879875183105]
[null,null,null,null,null,2014,1,1,null,null,null,null,null,null,null,null,1.1459879875183105,1.1459879875183105]
[null,null,null,null,null,2015,1,1,null,null,null,null,null,null,null,null,1.1459879875183105,1.1459879875183105]
[null,null,null,null,null,2016]
[null,null,null,null,null,2017]
[null,null,null,null,null,2018]
[null,null,null,null,null,2019]
[null,null,null,null,null,2020]
[null,null,null,null,null,2021]
[null,null,null,null,null,2022]
[null,null,null,null,null,2023]
[null,null,null,null,null,2024]
[null,null,null,null,null,2025]
[null,null,null,null,null,2026]
[null,null,null,null,null,2027]
[null,null,null,null,null,2028]
[null,"Access point frequency (CMF13,w,x,at,pdo):",null,null,"Signal"]
[null,null,null,null,"Year:",{"$f":"Main!$AK$5","v":2005},1.0933628082275391,1.0933628082275391,null,null,null,null,null,null,null,null,1.3553996086120605,1.3553996086120605]
[null,null,null,null,null,{"$f":"F316+1","v":2006},1.0933810472488403,1.0933810472488403,null,null,null,null,null,null,null,null,1.3553996086120605,1.3553996086120605]
[null,null,null,null,null,{"$f":"F317+1","v":2007},1.0933988094329834,1.0933988094329834,null,null,null,null,null,null,null,null,1.3553996086120605,1.3553996086120605]
[null,null,null,null,null,2008]
[null,null,null,null,null,2009]
[null,null,null,null,null,2010]
[null,null,null,null,null,2011]
[null,null,null,null,null,2012]
[null,null,null,null,null,2013,1.0920888185501099,1.0920888185501099,null,null,null,null,null,null,null,null,1.3553996086120605,1.3553996086120605]
[null,null,null,null,null,2014,1.0918737649917603,1.0918737649917603,null,null,null,null,null,null,null,null,1.3553996086120605,1.3553996086120605]
[null,null,null,null,null,2015,1.0918737649917603,1.0918737649917603,null,null,null,null,null,null,null,null,1.3553996086120605,1.3553996086120605]
[null,null,null,null,null,2016]
[null,null,null,null,null,2017]
[null,null,null,null,null,2018]
[null,null,null,null,null,2019]
[null,null,null,null,null,2020]
[null,null,null,null,null,2021]
[null,null,null,null,null,2022]
[null,null,null,null,null,2023]
[null,null,null,null,null,2024]
[null,null,null,null,null,2025]
[null,null,null,null,null,2026]
[null,null,null,null,null,2027]
[null,null,null,null,null,2028]
[null,"Crossroad left-turn lane (CMF11,w,x,at,pdo):",null,null,"Signal","Unsig"]
[null,null,null,null,"Year:",{"$f":"Main!$AK$5","v":2005},0.86726003885269165,0.86726003885269165,0.84416764974594116,0.84416764974594116,1,1,null,null,0.84588342905044556,0.84588342905044556,1,1]
[null,null,null,null,null,{"$f":"F341+1","v":2006},0.86723423004150391,0.86723423004150391,0.84429168701171875,0.84429168701171875,1,1,null,null,0.84588342905044556,0.84588342905044556,1,1]
[null,null,null,null,null,{"$f":"F342+1","v":2007},0.86720889806747437,0.86720889806747437,0.84408146142959595,0.84408146142959595,1,1,null,null,0.84588342905044556,0.84588342905044556,1,1]
[null,null,null,null,null,2008]
[null,null,null,null,null,2009]
[null,null,null,null,null,2010]
[null,null,null,null,null,2011]
[null,null,null,null,null,2012]
[null,null,null,null,null,2013,0.86458313465118408,0.86458313465118408,0.84408146142959595,0.84408146142959595,1,1,null,null,0.84588342905044556,0.84588342905044556,1,1]
[null,null,null,null,null,2014,0.86415219306945801,0.86415219306945801,0.84408146142959595,0.84408146142959595,1,1,null,null,0.84588342905044556,0.84588342905044556,1,1]
[null,null,null,null,null,2015,0.86415219306945801,0.86415219306945801,0.84408146142959595,0.84408146142959595,1,1,null,null,0.84588342905044556,0.84588342905044556,1,1]
[null,null,null,null,null,2016]
[null,null,null,null,null,2017]
[null,null,null,null,null,2018]
[null,null,null,null,null,2019]
[null,null,null,null,null,2020]
[null,null,null,null,null,2021]
[null,null,null,null,null,2022]
[null,null,null,null,null,2023]
[null,null,null,null,null,2024]
[null,null,null,null,null,2025]
[null,null,null,null,null,2026]
[null,null,null,null,null,2027]
[null,null,null,null,null,2028]
[null,"Crossroad right-turn lane (CMF12,w,x,at,pdo):",null,null,"Signal","Unsig"]
[null,null,null,null,"Year:",{"$f":"Main!$AK$5","v":2005},0.97511124610900879,0.97511124610900879,0.88498085737228394,0.88498085737228394,1,1,null,null,1,1,0.94979000091552734,0.94979000091552734]
[null,null,null,null,null,{"$f":"F366+1","v":2006},0.97510641813278198,0.97510641813278198,0.88482564687728882,0.88482564687728882,1,1,null,null,1,1,0.94979000091552734,0.94979000091552734]
[null,null,null,null,null,{"$f":"F367+1","v":2007},0.97510164976119995,0.97510164976119995,0.88491725921630859,0.88491725921630859,1,1,null,null,1,1,0.94979000091552734,0.94979000091552734]
[null,null,null,null,null,2008]
[null,null,null,null,null,2009]
[null,null,null,null,null,2010]
[null,null,null,null,null,2011]
[null,null,null,null,null,2012]
[null,null,null,null,null,2013,0.97545087337493896,0.97545087337493896,0.88491725921630859,0.88491725921630859,1,1,null,null,1,1,0.94979000091552734,0.94979000091552734]
[null,null,null,null,null,2014,0.97550821304321289,0.97550821304321289,0.88491725921630859,0.88491725921630859,1,1,null,null,1,1,0.94979000091552734,0.94979000091552734]
[null,null,null,null,null,2015,0.97550821304321289,0.97550821304321289,0.88491725921630859,0.88491725921630859,1,1,null,null,1,1,0.94979000091552734,0.94979000091552734]
[null,null,null,null,null,2016]
[null,null,null,null,null,2017]
[null,null,null,null,null,2018]
[null,null,null,null,null,2019]
[null,null,null,null,null,2020]
[null,null,null,null,null,2021]
[null,null,null,null,null,2022]
[null,null,null,null,null,2023]
[null,null,null,null,null,2024]
[null,null,null,null,null,2025]
[null,null,null,null,null,2026]
[null,null,null,null,null,2027]
[null,null,null,null,null,2028]
[null,"Median width (CMF15,w,x,at,pdo):",null,null,"Signal"]
[null,null,null,null,"Year:",{"$f":"Main!$AK$5","v":2005},1,1,null,null,null,null,null,null,null,null,1,1]
[null,null,null,null,null,{"$f":"F391+1","v":2006},1,1,null,null,null,null,null,null,null,null,1,1]
[null,null,null,null,null,{"$f":"F392+1","v":2007},1,1,null,null,null,null,null,null,null,null,1,1]
[null,null,null,null,null,2008]
[null,null,null,null,null,2009]
[null,null,null,null,null,2010]
[null,null,null,null,null,2011]
[null,null,null,null,null,2012]
[null,null,null,null,null,2013,1,1,null,null,null,null,null,null,null,null,1,1]
[null,null,null,null,null,2014,1,1,null,null,null,null,null,null,null,null,1,1]
[null,null,null,null,null,2015,1,1,null,null,null,null,null,null,null,null,1,1]
[null,null,null,null,null,2016]
[null,null,null,null,null,2017]
[null,null,null,null,null,2018]
[null,null,null,null,null,2019]
[null,null,null,null,null,2020]
[null,null,null,null,null,2021]
[null,null,null,null,null,2022]
[null,null,null,null,null,2023]
[null,null,null,null,null,2024]
[null,null,null,null,null,2025]
[null,null,null,null,null,2026]
[null,null,null,null,null,2027]
[null,null,null,null,null,2028]
[null,{"$f":"IF(Main!$AK$14=TRUE, \"Expected Average Crash Frequency\", \"Predicted Average Crash Frequency\")","v":"Expected Average Crash Frequency"}]
[null,"Fatal-and-Injury Crash Frequency"]
[null,"Ramp Terminal Crash Analysis",null,null,null,"Year"]
[null,"Overdispersion parameter (kw,x,at,fi):",null,null,null,null,8.6956523358821869E-2,null,0.29411762952804565,null,0.46296295523643494,null,0.38759690523147583,null,1.0893245935440063,null,0.11467889696359634]
[null,"Observed crash count (N*o,w,x,at,fi), crashes:",null,null,null,null,36,null,2,null,0,null,0,null,6,null,4]
[null,"Reference year (r):",null,null,null,null,2005,null,2005,null,2005,null,2005,null,2005,null,2005]
[null,"Predicted average crash freq. for reference year (Np,w,x,at,fi,r), crashes/yr:",null,null,null,null,7.2571640014648438,null,0.33221951127052307,null,0.31357085704803467,null,0.13182586431503296,null,0.59949290752410889,null,2.4939393997192383]
[null,"Equivalent years associated with crash count (Cb,w,x,at,fi,r), yr:",null,null,null,null,3.0034046173095703,null,3.0009171962738037,null,3,null,3,null,3,null,3]
[null,"Expected average crash freq. for reference year given N*o (Na,w,x,at,fi,r), crashes/yr:",null,null,null,null,10.352992057800293,null,0.40800553560256958,null,0.21843788027763367,null,0.11430457979440689,null,1.5267161130905151,null,1.9579845666885376]
[null,{"$f":"IF(Main!$AK$14=TRUE, \"Expected average crash frequency\", \"Predicted average crash frequency\")","v":"Expected average crash frequency"},null,null,null,{"$f":"Main!$AK$5","v":2005},10.352992057800293,null,0.40800553560256958,null,0.21843788027763367,null,0.11430457979440689,null,1.5267161130905151,null,1.9579845666885376]
[null,"  (Ne,w,x,at,fi), crashes/yr:","(Np,w,x,at,fi), crashes/yr:",null,null,{"$f":"F424+1","v":2006},10.364810943603516,null,0.40816786885261536,null,0.21843788027763367,null,0.11430457979440689,null,1.5267161130905151,null,1.9579845666885376]
[null,null,null,null,null,{"$f":"F425+1","v":2007},10.376422882080078,null,0.40821737051010132,null,0.21843788027763367,null,0.11430457979440689,null,1.5267161130905151,null,1.9579845666885376]
[null,null,null,null,null,2008]
[null,null,null,null,null,2009]
[null,null,null,null,null,2010]
[null,null,null,null,null,2011]
[null,null,null,null,null,2012]
[null,null,null,null,null,2013,null,10.496696472167969,null,0.40821737051010132,null,0.21843788027763367,null,0.11430457979440689,null,1.5267161130905151,null,1.9579845666885376]
[null,null,null,null,null,2014,null,10.516772270202637,null,0.40821737051010132,null,0.21843788027763367,null,0.11430457979440689,null,1.5267161130905151,null,1.9579845666885376]
[null,null,null,null,null,2015,null,10.516772270202637,null,0.40821737051010132,null,0.21843788027763367,null,0.11430457979440689,null,1.5267161130905151,null,1.9579845666885376]
[null,null,null,null,null,2016]
[null,null,null,null,null,2017]
[null,null,null,null,null,2018]
[null,null,null,null,null,2019]
[null,null,null,null,null,2020]
[null,null,null,null,null,2021]
[null,null,null,null,null,2022]
[null,null,null,null,null,2023]
[null,null,null,null,null,2024]
[null,null,null,null,null,2025]
[null,null,null,null,null,2026]
[null,null,null,null,null,2027]
[null,null,null,null,null,2028]
[null,"Project Level Crash Analysis",null,null,null,"Year","Project"]
[null,"Observed crash count (N*o,aS,ac,at,fi), crashes:"]
[null,"Reference year (r):"]
[null,"Predicted average crash freq. for reference year (Np,aS,ac,at,fi,r), crashes/yr:"]
[null,"Equivalent years associated with crash count (Cb,aS,ac,at,fi,r), yr:"]
[null,"Independent sites crash analysis"]
[null,"   Variance when site crash frequencies are independent (V0,aS,ac,at,fi):"]
[null,"   Weight associated with Np,...r (w0,aS,ac,at,fi):"]
[null,"   Expected average crash freq. for reference year given N*o (N0,aS,ac,at,fi,r), crashes/yr:"]
[null,"Correlated sites crash analysis"]
[null,"   Variance when site crash frequencies are correlated (V1,aS,ac,at,fi):"]
[null,"   Weight associated with Np,...r (w1,aS,ac,at,fi):"]
[null,"   Expected average crash freq. for reference year given N*o (N1,aS,ac,at,fi,r), crashes/yr:"]
[null,"Expected average crash frequency",null,null,null,{"$f":"F424","v":2005}]
[null,"  (Ne,aS,ac,at,fi), crashes/year:",null,null,null,{"$f":"F425","v":2006}]
[null,null,null,null,null,2007]
[null,null,null,null,null,2008]
[null,null,null,null,null,2009]
[null,null,null,null,null,2010]
[null,null,null,null,null,2011]
[null,null,null,null,null,2012]
[null,null,null,null,null,2013]
[null,null,null,null,null,2014]
[null,null,null,null,null,2015]
[null,null,null,null,null,2016]
[null,null,null,null,null,2017]
[null,null,null,null,null,2018]
[null,null,null,null,null,2019]
[null,null,null,null,null,2020]
[null,null,null,null,null,2021]
[null,null,null,null,null,2022]
[null,null,null,null,null,2023]
[null,null,null,null,null,2024]
[null,null,null,null,null,2025]
[null,null,null,null,null,2026]
[null,null,null,null,null,2027]
[null,null,null,null,null,2028]
[null,"Property-Damage-Only Crash Frequency"]
[null,"Ramp Terminal Crash Analysis",null,null,null,"Year"]
[null,"Overdispersion parameter (kw,x,at,pdo):",null,null,null,null,0.13869625329971313,null,0.18214936554431915,null,0.15220700204372406,null,0.23419204354286194,null,0.25641024112701416,null,0.24691356718540192]
[null,"Observed crash count (N*o,w,x,at,pdo), crashes:",null,null,null,null,30,null,1,null,2,null,0,null,2,null,7]
[null,"Reference year (r):",null,null,null,null,2005,null,2005,null,2005,null,2005,null,2005,null,2005]
[null,"Predicted average crash freq. for reference year (Np,w,x,at,pdo,r), crashes/yr:",null,null,null,null,12.368651390075684,null,0.63341385126113892,null,0.54218333959579468,null,0.53418034315109253,null,1.0512253046035767,null,4.0139718055725098]
[null,"Equivalent years associated with crash count (Cb,w,x,at,pdo,r), yr:",null,null,null,null,3.0028083324432373,null,3.0022866725921631,null,3,null,3,null,3,null,3]
[null,"Expected average crash freq. for reference year given N*o (Na,w,x,at,pdo,r), crashes/yr:",null,null,null,null,10.37723445892334,null,0.55614560842514038,null,0.56688618659973145,null,0.38840937614440918,null,0.87929040193557739,null,2.7563149929046631]
[null,{"$f":"IF(Main!$AK$14=TRUE, \"Expected average crash frequency\", \"Predicted average crash frequency\")","v":"Expected average crash frequency"},null,null,null,{"$f":"Main!$AK$5","v":2005},10.37723445892334,null,0.55614560842514038,null,0.56688618659973145,null,0.38840937614440918,null,0.87929040193557739,null,2.7563149929046631]
[null,"  (Ne,w,x,at,pdo), crashes/yr:","(Np,w,x,at,pdo), crashes/yr:",null,null,{"$f":"F493+1","v":2006},10.387007713317871,null,0.55659127235412598,null,0.56688618659973145,null,0.38840937614440918,null,0.87929040193557739,null,2.7563149929046631]
[null,null,null,null,null,{"$f":"F494+1","v":2007},10.396605491638184,null,0.55697166919708252,null,0.56688618659973145,null,0.38840937614440918,null,0.87929040193557739,null,2.7563149929046631]
[null,null,null,null,null,2008]
[null,null,null,null,null,2009]
[null,null,null,null,null,2010]
[null,null,null,null,null,2011]
[null,null,null,null,null,2012]
[null,null,null,null,null,2013,null,10.470378875732422,null,0.55697166919708252,null,0.56688618659973145,null,0.38840937614440918,null,0.87929040193557739,null,2.7563149929046631]
[null,null,null,null,null,2014,null,10.482687950134277,null,0.55697166919708252,null,0.56688618659973145,null,0.38840937614440918,null,0.87929040193557739,null,2.7563149929046631]
[null,null,null,null,null,2015,null,10.482687950134277,null,0.55697166919708252,null,0.56688618659973145,null,0.38840937614440918,null,0.87929040193557739,null,2.7563149929046631]
[null,null,null,null,null,2016]
[null,null,null,null,null,2017]
[null,null,null,null,null,2018]
[null,null,null,null,null,2019]
[null,null,null,null,null,2020]
[null,null,null,null,null,2021]
[null,null,null,null,null,2022]
[null,null,null,null,null,2023]
[null,null,null,null,null,2024]
[null,null,null,null,null,2025]
[null,null,null,null,null,2026]
[null,null,null,null,null,2027]
[null,null,null,null,null,2028]
[null,"Project Level Crash Analysis",null,null,null,"Year","Project"]
[null,"Observed crash count (N*o,aS,ac,at,pdo), crashes:"]
[null,"Reference year (r):"]
[null,"Predicted average crash freq. for reference year (Np,aS,ac,at,pdo,r), crashes/yr:"]
[null,"Equivalent years associated with crash count (Cb,aS,ac,at,pdo,r), yr:"]
[null,"Independent sites crash analysis"]
[null,"   Variance when site crash frequencies are independent (V0,aS,ac,at,pdo):"]
[null,"   Weight associated with Np,...r (w0,aS,ac,at,pdo):"]
[null,"   Expected average crash freq. for reference year given N*o (N0,aS,ac,at,pdo,r), crashes/yr:"]
[null,"Correlated sites crash analysis"]
[null,"   Variance when site crash frequencies are correlated (V1,aS,ac,at,pdo):"]
[null,"   Weight associated with Np,...r (w1,aS,ac,at,pdo):"]
[null,"   Expected average crash freq. for reference year given N*o (N1,aS,ac,at,pdo,r), crashes/yr:"]
[null,"Expected average crash frequency",null,null,null,{"$f":"F493","v":2005}]
[null,"  (Ne,aS,ac,at,pdo), crashes/year:",null,null,null,{"$f":"F494","v":2006}]
[null,null,null,null,null,2007]
[null,null,null,null,null,2008]
[null,null,null,null,null,2009]
[null,null,null,null,null,2010]
[null,null,null,null,null,2011]
[null,null,null,null,null,2012]
[null,null,null,null,null,2013]
[null,null,null,null,null,2014]
[null,null,null,null,null,2015]
[null,null,null,null,null,2016]
[null,null,null,null,null,2017]
[null,null,null,null,null,2018]
[null,null,null,null,null,2019]
[null,null,null,null,null,2020]
[null,null,null,null,null,2021]
[null,null,null,null,null,2022]
[null,null,null,null,null,2023]
[null,null,null,null,null,2024]
[null,null,null,null,null,2025]
[null,null,null,null,null,2026]
[null,null,null,null,null,2027]
[null,null,null,null,null,2028]
[null,"Crash Severity Distribution",null,null,{"$f":"IF(Main!$AK$15=TRUE, \"Project Study Period\", \"\")","v":""}]
[null," (during Study Period)"]
[null,"Fatal crash frequency (N*e,w,x,at,K), crashes:",null,null,null,null,null,3.1082361936569214E-2,null,6.4928303472697735E-3,null,3.4743256401270628E-3,null,1.8180515617132187E-3,null,2.4282917380332947E-2,null,8.382393978536129E-3]
[null,"Incapacitating injury crash freq. (N*e,w,x,at,A), crashes:",null,null,null,null,null,0.77705907821655273,null,3.408735990524292E-2,null,1.8240209668874741E-2,null,9.5447711646556854E-3,null,0.12748531997203827,null,0.2095598429441452]
[null,"Non-incapacitating inj. crash freq. (N*e,w,x,at,B), crashes:",null,null,null,null,null,5.3555412292480469,null,0.22027570009231567,null,0.11786994338035583,null,6.1679203063249588E-2,null,0.82382208108901978,null,1.4503787755966187]
[null,"Possible injury crash freq. (N*e,w,x,at,C), crashes:",null,null,null,null,null,25.366558074951172,null,0.96379625797271729,null,0.51572918891906738,null,0.26987174153327942,null,3.6045582294464111,null,4.2056326866149902]
[null,"  Total fatal-and-injury crash freq. (N*e,w,x,at,fi), crashes:",null,null,null,null,null,31.530242919921875,null,1.2246520519256592,null,0.65531361103057861,null,0.34291374683380127,null,4.5801482200622559,null,5.8739538192749023]
[null,"Property-damage-only crash freq. (N*e,w,x,at,pdo), crashes:",null,null,null,null,null,31.435756683349609,null,1.6709150075912476,null,1.7006585597991943,null,1.1652281284332275,null,2.637871265411377,null,8.2689447402954102]
[null,"  Total crash frequency (N*e,w,x,at,as), crashes:",null,null,null,null,null,62.965999603271484,null,2.8955669403076172,null,2.3559722900390625,null,1.5081418752670288,null,7.2180194854736328,null,14.142898559570313]
[null,"Intermediate Results",null,null,null,"Year"]
[null,"Proportion of total leg AADT on the crossroad (Pxrd):",null,null,null,{"$f":"Main!$AK$5","v":2005},0.82962483167648315,0.82962483167648315,0.74205887317657471,0.74205887317657471,0.84701138734817505,0.84701138734817505,0.62592560052871704,0.62592560052871704,0.73388844728469849,0.73388844728469849,0.8476104736328125,0.8476104736328125]
[null,null,null,null,null,{"$f":"F564+1","v":2006},0.82978618144989014,0.82978618144989014,0.74226421117782593,0.74226421117782593,0.84701138734817505,0.84701138734817505,0.62592560052871704,0.62592560052871704,0.73388844728469849,0.73388844728469849,0.8476104736328125,0.8476104736328125]
[null,null,null,null,null,{"$f":"F565+1","v":2007},0.82994437217712402,0.82994437217712402,0.74246925115585327,0.74246925115585327,0.84701138734817505,0.84701138734817505,0.62592560052871704,0.62592560052871704,0.73388844728469849,0.73388844728469849,0.8476104736328125,0.8476104736328125]
[null,null,null,null,null,2008]
[null,null,null,null,null,2009]
[null,null,null,null,null,2010]
[null,null,null,null,null,2011]
[null,null,null,null,null,2012]
[null,null,null,null,null,2013,0.83232957124710083,0.83232957124710083,0.74246925115585327,0.74246925115585327,0.84701138734817505,0.84701138734817505,0.62592560052871704,0.62592560052871704,0.73388844728469849,0.73388844728469849,0.8476104736328125,0.8476104736328125]
[null,null,null,null,null,2014,0.8327210545539856,0.8327210545539856,0.74246925115585327,0.74246925115585327,0.84701138734817505,0.84701138734817505,0.62592560052871704,0.62592560052871704,0.73388844728469849,0.73388844728469849,0.8476104736328125,0.8476104736328125]
[null,null,null,null,null,2015,0.8327210545539856,0.8327210545539856,0.74246925115585327,0.74246925115585327,0.84701138734817505,0.84701138734817505,0.62592560052871704,0.62592560052871704,0.73388844728469849,0.73388844728469849,0.8476104736328125,0.8476104736328125]
[null,null,null,null,null,2016]
[null,null,null,null,null,2017]
[null,null,null,null,null,2018]
[null,null,null,null,null,2019]
[null,null,null,null,null,2020]
[null,null,null,null,null,2021]
[null,null,null,null,null,2022]
[null,null,null,null,null,2023]
[null,null,null,null,null,2024]
[null,null,null,null,null,2025]
[null,null,null,null,null,2026]
[null,null,null,null,null,2027]
[null,null,null,null,null,2028]
[null,"Proportion of total leg AADT on the inside crossroad leg (Pin):",null,null,null,{"$f":"Main!$AK$5","v":2005},0.41481241583824158,0.41481241583824158,0.37102943658828735,0.37102943658828735,0.42350569367408752,0.42350569367408752,0.31296280026435852,0.31296280026435852,0.36694422364234924,0.36694422364234924,0.42380523681640625,0.42380523681640625]
[null,null,null,null,null,{"$f":"F588+1","v":2006},0.41489309072494507,0.41489309072494507,0.37153017520904541,0.37153017520904541,0.42350569367408752,0.42350569367408752,0.31296280026435852,0.31296280026435852,0.36694422364234924,0.36694422364234924,0.42380523681640625,0.42380523681640625]
[null,null,null,null,null,{"$f":"F589+1","v":2007},0.41497218608856201,0.41497218608856201,0.37123462557792664,0.37123462557792664,0.42350569367408752,0.42350569367408752,0.31296280026435852,0.31296280026435852,0.36694422364234924,0.36694422364234924,0.42380523681640625,0.42380523681640625]
[null,null,null,null,null,2008]
[null,null,null,null,null,2009]
[null,null,null,null,null,2010]
[null,null,null,null,null,2011]
[null,null,null,null,null,2012]
[null,null,null,null,null,2013,0.42317762970924377,0.42317762970924377,0.37123462557792664,0.37123462557792664,0.42350569367408752,0.42350569367408752,0.31296280026435852,0.31296280026435852,0.36694422364234924,0.36694422364234924,0.42380523681640625,0.42380523681640625]
[null,null,null,null,null,2014,0.4245244562625885,0.4245244562625885,0.37123462557792664,0.37123462557792664,0.42350569367408752,0.42350569367408752,0.31296280026435852,0.31296280026435852,0.36694422364234924,0.36694422364234924,0.42380523681640625,0.42380523681640625]
[null,null,null,null,null,2015,0.4245244562625885,0.4245244562625885,0.37123462557792664,0.37123462557792664,0.42350569367408752,0.42350569367408752,0.31296280026435852,0.31296280026435852,0.36694422364234924,0.36694422364234924,0.42380523681640625,0.42380523681640625]
[null,null,null,null,null,2016]
[null,null,null,null,null,2017]
[null,null,null,null,null,2018]
[null,null,null,null,null,2019]
[null,null,null,null,null,2020]
[null,null,null,null,null,2021]
[null,null,null,null,null,2022]
[null,null,null,null,null,2023]
[null,null,null,null,null,2024]
[null,null,null,null,null,2025]
[null,null,null,null,null,2026]
[null,null,null,null,null,2027]
[null,null,null,null,null,2028]
[null,"Proportion of total leg AADT on the outside crossroad leg (Pout):",null,null,null,{"$f":"Main!$AK$5","v":2005},0.41481241583824158,0.41481241583824158,0.37102943658828735,0.37102943658828735,0.42350569367408752,0.42350569367408752,0.31296280026435852,0.31296280026435852,0.36694422364234924,0.36694422364234924,0.42380523681640625,0.42380523681640625]
[null,null,null,null,null,{"$f":"F612+1","v":2006},0.41489309072494507,0.41489309072494507,0.37073403596878052,0.37073403596878052,0.42350569367408752,0.42350569367408752,0.31296280026435852,0.31296280026435852,0.36694422364234924,0.36694422364234924,0.42380523681640625,0.42380523681640625]
[null,null,null,null,null,{"$f":"F613+1","v":2007},0.41497218608856201,0.41497218608856201,0.37123462557792664,0.37123462557792664,0.42350569367408752,0.42350569367408752,0.31296280026435852,0.31296280026435852,0.36694422364234924,0.36694422364234924,0.42380523681640625,0.42380523681640625]
[null,null,null,null,null,2008]
[null,null,null,null,null,2009]
[null,null,null,null,null,2010]
[null,null,null,null,null,2011]
[null,null,null,null,null,2012]
[null,null,null,null,null,2013,0.40915191173553467,0.40915191173553467,0.37123462557792664,0.37123462557792664,0.42350569367408752,0.42350569367408752,0.31296280026435852,0.31296280026435852,0.36694422364234924,0.36694422364234924,0.42380523681640625,0.42380523681640625]
[null,null,null,null,null,2014,0.40819659829139709,0.40819659829139709,0.37123462557792664,0.37123462557792664,0.42350569367408752,0.42350569367408752,0.31296280026435852,0.31296280026435852,0.36694422364234924,0.36694422364234924,0.42380523681640625,0.42380523681640625]
[null,null,null,null,null,2015,0.40819659829139709,0.40819659829139709,0.37123462557792664,0.37123462557792664,0.42350569367408752,0.42350569367408752,0.31296280026435852,0.31296280026435852,0.36694422364234924,0.36694422364234924,0.42380523681640625,0.42380523681640625]
[null,null,null,null,null,2016]
[null,null,null,null,null,2017]
[null,null,null,null,null,2018]
[null,null,null,null,null,2019]
[null,null,null,null,null,2020]
[null,null,null,null,null,2021]
[null,null,null,null,null,2022]
[null,null,null,null,null,2023]
[null,null,null,null,null,2024]
[null,null,null,null,null,2025]
[null,null,null,null,null,2026]
[null,null,null,null,null,2027]
[null,null,null,null,null,2028]
[null,"Proportion of total leg AADT on the exit ramp leg (Pex):",null,null,null,{"$f":"Main!$AK$5","v":2005},0.10545965284109116,0.10545965284109116,4.2813129723072052E-2,4.2813129723072052E-2,0.15298861265182495,0.15298861265182495,8.1538856029510498E-2,8.1538856029510498E-2,7.4188172817230225E-2,7.4188172817230225E-2,4.598737508058548E-2,4.598737508058548E-2]
[null,null,null,null,null,{"$f":"F636+1","v":2006},0.10535978525876999,0.10535978525876999,4.2779047042131424E-2,4.2779047042131424E-2,0.15298861265182495,0.15298861265182495,8.1538856029510498E-2,8.1538856029510498E-2,7.4188172817230225E-2,7.4188172817230225E-2,4.598737508058548E-2,4.598737508058548E-2]
[null,null,null,null,null,{"$f":"F637+1","v":2007},0.10526184737682343,0.10526184737682343,4.2745016515254974E-2,4.2745016515254974E-2,0.15298861265182495,0.15298861265182495,8.1538856029510498E-2,8.1538856029510498E-2,7.4188172817230225E-2,7.4188172817230225E-2,4.598737508058548E-2,4.598737508058548E-2]
[null,null,null,null,null,2008]
[null,null,null,null,null,2009]
[null,null,null,null,null,2010]
[null,null,null,null,null,2011]
[null,null,null,null,null,2012]
[null,null,null,null,null,2013,0.10378547012805939,0.10378547012805939,4.2745016515254974E-2,4.2745016515254974E-2,0.15298861265182495,0.15298861265182495,8.1538856029510498E-2,8.1538856029510498E-2,7.4188172817230225E-2,7.4188172817230225E-2,4.598737508058548E-2,4.598737508058548E-2]
[null,null,null,null,null,2014,0.10354314744472504,0.10354314744472504,4.2745016515254974E-2,4.2745016515254974E-2,0.15298861265182495,0.15298861265182495,8.1538856029510498E-2,8.1538856029510498E-2,7.4188172817230225E-2,7.4188172817230225E-2,4.598737508058548E-2,4.598737508058548E-2]
[null,null,null,null,null,2015,0.10354314744472504,0.10354314744472504,4.2745016515254974E-2,4.2745016515254974E-2,0.15298861265182495,0.15298861265182495,8.1538856029510498E-2,8.1538856029510498E-2,7.4188172817230225E-2,7.4188172817230225E-2,4.598737508058548E-2,4.598737508058548E-2]
[null,null,null,null,null,2016]
[null,null,null,null,null,2017]
[null,null,null,null,null,2018]
[null,null,null,null,null,2019]
[null,null,null,null,null,2020]
[null,null,null,null,null,2021]
[null,null,null,null,null,2022]
[null,null,null,null,null,2023]
[null,null,null,null,null,2024]
[null,null,null,null,null,2025]
[null,null,null,null,null,2026]
[null,null,null,null,null,2027]
[null,null,null,null,null,2028]
[null,"Traffic Data",null,null,null,"Year"]
[null,"Inside Crossroad Leg Data ",null,null,null,{"$f":"Main!$AK$5","v":2005},49887,null,6985,null,7142,null,3677,null,8814,null,23500]
[null,"Average daily traffic (AADTin) by year, veh/d:",null,null,null,{"$f":"F661+1","v":2006},49944,null,7000,null,7142,null,3677,null,8814,null,23500]
[null,null,null,null,null,{"$f":"F662+1","v":2007},50000,null,7000,null,7142,null,3677,null,8814,null,23500]
[null,null,null,null,null,2008,50286,null,7000,null,7142,null,3677,null,8814,null,23500]
[null,null,null,null,null,2009,50571,null,7000,null,7142,null,3677,null,8814,null,23500]
[null,null,null,null,null,2010,50857,null,7000,null,7142,null,3677,null,8814,null,23500]
[null,null,null,null,null,2011,51143,null,7000,null,7142,null,3677,null,8814,null,23500]
[null,null,null,null,null,2012,51429,null,7000,null,7142,null,3677,null,8814,null,23500]
[null,null,null,null,null,2013,51714,null,7000,null,7142,null,3677,null,8814,null,23500]
[null,null,null,null,null,2014,52000,null,7000,null,7142,null,3677,null,8814,null,23500]
[null,null,null,null,null,2015,52000,null,7000,null,7142,null,3677,null,8814,null,23500]
[null,null,null,null,null,2016,52000,null,7000,null,7142,null,3677,null,8814,null,23500]
[null,null,null,null,null,2017,52000,null,7000,null,7142,null,3677,null,8814,null,23500]
[null,null,null,null,null,2018,52000,null,7000,null,7142,null,3677,null,8814,null,23500]
[null,null,null,null,null,2019,52000,null,7000,null,7142,null,3677,null,8814,null,23500]
[null,null,null,null,null,2020,52000,null,7000,null,7142,null,3677,null,8814,null,23500]
[null,null,null,null,null,2021,52000,null,7000,null,7142,null,3677,null,8814,null,23500]
[null,null,null,null,null,2022,52000,null,7000,null,7142,null,3677,null,8814,null,23500]
[null,null,null,null,null,2023,52000,null,7000,null,7142,null,3677,null,8814,null,23500]
[null,null,null,null,null,2024,52000,null,7000,null,7142,null,3677,null,8814,null,23500]
[null,null,null,null,null,2025,52000,null,7000,null,7142,null,3677,null,8814,null,23500]
[null,null,null,null,null,2026,52000,null,7000,null,7142,null,3677,null,8814,null,23500]
[null,null,null,null,null,2027,52000,null,7000,null,7142,null,3677,null,8814,null,23500]
[null,null,null,null,null,2028,52000,null,7000,null,7142,null,3677,null,8814,null,23500]
[null,"Outside Crossroad Leg Data ",null,null,null,{"$f":"Main!$AK$5","v":2005},49887,null,6985,null,7142,null,3677,null,8814,null,23500]
[null,"Average daily traffic (AADTout) by year, veh/d:",null,null,null,{"$f":"F685+1","v":2006},49944,null,6985,null,7142,null,3677,null,8814,null,23500]
[null,null,null,null,null,{"$f":"F686+1","v":2007},50000,null,7000,null,7142,null,3677,null,8814,null,23500]
[null,null,null,null,null,2008,50000,null,7000,null,7142,null,3677,null,8814,null,23500]
[null,null,null,null,null,2009,50000,null,7000,null,7142,null,3677,null,8814,null,23500]
[null,null,null,null,null,2010,50000,null,7000,null,7142,null,3677,null,8814,null,23500]
[null,null,null,null,null,2011,50000,null,7000,null,7142,null,3677,null,8814,null,23500]
[null,null,null,null,null,2012,50000,null,7000,null,7142,null,3677,null,8814,null,23500]
[null,null,null,null,null,2013,50000,null,7000,null,7142,null,3677,null,8814,null,23500]
[null,null,null,null,null,2014,50000,null,7000,null,7142,null,3677,null,8814,null,23500]
[null,null,null,null,null,2015,50000,null,7000,null,7142,null,3677,null,8814,null,23500]
[null,null,null,null,null,2016,50000,null,7000,null,7142,null,3677,null,8814,null,23500]
[null,null,null,null,null,2017,50000,null,7000,null,7142,null,3677,null,8814,null,23500]
[null,null,null,null,null,2018,50000,null,7000,null,7142,null,3677,null,8814,null,23500]
[null,null,null,null,null,2019,50000,null,7000,null,7142,null,3677,null,8814,null,23500]
[null,null,null,null,null,2020,50000,null,7000,null,7142,null,3677,null,8814,null,23500]
[null,null,null,null,null,2021,50000,null,7000,null,7142,null,3677,null,8814,null,23500]
[null,null,null,null,null,2022,50000,null,7000,null,7142,null,3677,null,8814,null,23500]
[null,null,null,null,null,2023,50000,null,7000,null,7142,null,3677,null,8814,null,23500]
[null,null,null,null,null,2024,50000,null,7000,null,7142,null,3677,null,8814,null,23500]
[null,null,null,null,null,2025,50000,null,7000,null,7142,null,3677,null,8814,null,23500]
[null,null,null,null,null,2026,50000,null,7000,null,7142,null,3677,null,8814,null,23500]
[null,null,null,null,null,2027,50000,null,7000,null,7142,null,3677,null,8814,null,23500]
[null,null,null,null,null,2028,50000,null,7000,null,7142,null,3677,null,8814,null,23500]
[null,"Exit Ramp Data ",null,null,null,{"$f":"Main!$AK$5","v":2005},12683,null,806,null,2580,null,958,null,1782,null,2550]
[null,"Average daily traffic (AADTex) by year, veh/d:",null,null,null,{"$f":"F709+1","v":2006},12683,null,806,null,2580,null,958,null,1782,null,2550]
[null,null,null,null,null,{"$f":"F710+1","v":2007},12683,null,806,null,2580,null,958,null,1782,null,2550]
[null,null,null,null,null,2008,12683,null,806,null,2580,null,958,null,1782,null,2550]
[null,null,null,null,null,2009,12683,null,806,null,2580,null,958,null,1782,null,2550]
[null,null,null,null,null,2010,12683,null,806,null,2580,null,958,null,1782,null,2550]
[null,null,null,null,null,2011,12683,null,806,null,2580,null,958,null,1782,null,2550]
[null,null,null,null,null,2012,12683,null,806,null,2580,null,958,null,1782,null,2550]
[null,null,null,null,null,2013,12683,null,806,null,2580,null,958,null,1782,null,2550]
[null,null,null,null,null,2014,12683,null,806,null,2580,null,958,null,1782,null,2550]
[null,null,null,null,null,2015,12683,null,806,null,2580,null,958,null,1782,null,2550]
[null,null,null,null,null,2016,12683,null,806,null,2580,null,958,null,1782,null,2550]
[null,null,null,null,null,2017,12683,null,806,null,2580,null,958,null,1782,null,2550]
[null,null,null,null,null,2018,12683,null,806,null,2580,null,958,null,1782,null,2550]
[null,null,null,null,null,2019,12683,null,806,null,2580,null,958,null,1782,null,2550]
[null,null,null,null,null,2020,12683,null,806,null,2580,null,958,null,1782,null,2550]
[null,null,null,null,null,2021,12683,null,806,null,2580,null,958,null,1782,null,2550]
[null,null,null,null,null,2022,12683,null,806,null,2580,null,958,null,1782,null,2550]
[null,null,null,null,null,2023,12683,null,806,null,2580,null,958,null,1782,null,2550]
[null,null,null,null,null,2024,12683,null,806,null,2580,null,958,null,1782,null,2550]
[null,null,null,null,null,2025,12683,null,806,null,2580,null,958,null,1782,null,2550]
[null,null,null,null,null,2026,12683,null,806,null,2580,null,958,null,1782,null,2550]
[null,null,null,null,null,2027,12683,null,806,null,2580,null,958,null,1782,null,2550]
[null,null,null,null,null,2028,12683,null,806,null,2580,null,958,null,1782,null,2550]
[null,"Entrance Ramp Data ",null,null,null,{"$f":"Main!$AK$5","v":2005},7807,null,4050,null,0,null,3437,null,4610,null,5900]
[null,"Average daily traffic (AADTen) by year, veh/d:",null,null,null,{"$f":"F733+1","v":2006},7807,null,4050,null,0,null,3437,null,4610,null,5900]
[null,null,null,null,null,{"$f":"F734+1","v":2007},7807,null,4050,null,0,null,3437,null,4610,null,5900]
[null,null,null,null,null,2008,7807,null,4050,null,0,null,3437,null,4610,null,5900]
[null,null,null,null,null,2009,7807,null,4050,null,0,null,3437,null,4610,null,5900]
[null,null,null,null,null,2010,7807,null,4050,null,0,null,3437,null,4610,null,5900]
[null,null,null,null,null,2011,7807,null,4050,null,0,null,3437,null,4610,null,5900]
[null,null,null,null,null,2012,7807,null,4050,null,0,null,3437,null,4610,null,5900]
[null,null,null,null,null,2013,7807,null,4050,null,0,null,3437,null,4610,null,5900]
[null,null,null,null,null,2014,7807,null,4050,null,0,null,3437,null,4610,null,5900]
[null,null,null,null,null,2015,7807,null,4050,null,0,null,3437,null,4610,null,5900]
[null,null,null,null,null,2016,7807,null,4050,null,0,null,3437,null,4610,null,5900]
[null,null,null,null,null,2017,7807,null,4050,null,0,null,3437,null,4610,null,5900]
[null,null,null,null,null,2018,7807,null,4050,null,0,null,3437,null,4610,null,5900]
[null,null,null,null,null,2019,7807,null,4050,null,0,null,3437,null,4610,null,5900]
[null,null,null,null,null,2020,7807,null,4050,null,0,null,3437,null,4610,null,5900]
[null,null,null,null,null,2021,7807,null,4050,null,0,null,3437,null,4610,null,5900]
[null,null,null,null,null,2022,7807,null,4050,null,0,null,3437,null,4610,null,5900]
[null,null,null,null,null,2023,7807,null,4050,null,0,null,3437,null,4610,null,5900]
[null,null,null,null,null,2024,7807,null,4050,null,0,null,3437,null,4610,null,5900]
[null,null,null,null,null,2025,7807,null,4050,null,0,null,3437,null,4610,null,5900]
[null,null,null,null,null,2026,7807,null,4050,null,0,null,3437,null,4610,null,5900]
[null,null,null,null,null,2027,7807,null,4050,null,0,null,3437,null,4610,null,5900]
[null,null,null,null,null,2028,7807,null,4050,null,0,null,3437,null,4610,null,5900]

{"sheet":"Calibration Factors","index":10,"n_rows":411,"n_cols":20,"rows_kept":411,"cut":false,"hidden":false,"merged":[[2,15,2,19],[383,10,383,11],[383,12,383,13],[4,18,4,19],[5,18,5,19],[6,18,6,19],[7,18,7,19],[8,18,8,19],[178,12,179,12],[99,1,99,13],[101,1,102,2],[101,3,102,3],[101,4,102,6],[176,1,176,13],[279,11,280,11],[279,12,280,12],[279,13,280,13],[3,18,3,19],[3,15,3,17],[382,1,384,2],[382,3,384,4],[382,5,384,7],[382,8,382,13],[383,8,383,9],[178,3,179,3],[178,13,179,13],[178,6,179,7],[178,4,179,5],[279,1,280,2],[279,3,280,3],[279,4,280,5],[279,6,280,7],[279,8,280,8],[178,1,179,2],[178,8,179,8],[178,9,179,9],[178,10,179,10],[178,11,179,11],[279,9,280,9],[279,10,280,10],[35,3,36,3],[68,1,70,2],[68,3,70,4],[122,9,123,9],[101,7,102,7],[122,7,123,7],[101,8,102,8],[101,11,102,11],[101,9,102,9],[101,10,102,10],[122,1,123,2],[122,3,123,3],[122,4,123,6],[35,13,36,13],[35,10,36,10],[35,11,36,11],[35,12,36,12],[68,5,70,7],[68,8,68,13],[69,8,69,9],[69,10,69,11],[69,12,69,13],[101,12,102,12],[101,13,102,13],[2,1,2,13],[4,1,5,2],[4,3,5,3],[4,9,5,9],[4,10,5,10],[4,11,5,11],[4,12,5,12],[4,13,5,13],[4,4,5,6],[35,4,36,6],[4,7,5,8],[35,7,36,8],[35,9,36,9],[35,1,36,2],[122,13,123,13],[122,8,123,8],[122,11,123,11],[122,10,123,10],[122,12,123,12],[145,1,147,2],[145,3,147,4],[145,5,147,7],[146,12,146,13],[145,8,145,13],[146,8,146,9],[146,10,146,11]]}
[]
[null,null,null,null,null,null,null,null,null,null,null,null,null,null,null,null,null,null,"        See notes"]
[null,"Freeway Model Calibration Factors and Default Values",null,null,null,null,null,null,null,null,null,null,null,null,null,"Present Worth Analysis Parameters"]
[null,"Freeway Fatal-and-Injury Crash Frequency Models",null,null,null,null,null,null,null,"Model:   exp(a + b ln[c AADTfs]) L",null,null,null,null,null,"Crash Severity",null,null,"Cost per Crash"]
[null,"Area Type",null,"Through Lanes","Model",null,null,"Location",null,"a","b","c","Inverse Disp. (K), mi","Calib. Factor (C)",null,"Fatal (K)",null,null,10890000]
[null,null,null,null,null,null,null,null,null,null,null,null,null,null,null,"Severe injury (A)",null,null,888030]
[null,"Rural",null,4,"Multiple-vehicle",null,null,"Freeway segment",null,{"$f":"(-5.47-0.505)","v":-5.9749999999999996},1.492,1E-3,{"$f":"17.6","v":17.600000000000001},1,null,"Moderate injury (B)",null,null,180180]
[null,null,null,null,"Single-vehicle",null,null,"Freeway segment",null,{"$f":"(-2.266+0.0351*D7)","v":-2.1255999999999999},0.64600000000000002,1E-3,{"$f":"30.1","v":30.1},1,null,"Minor injury (C)",null,null,103950]
[null,null,null,null,"Ramp-entrance",null,null,"Speed-change lane",null,{"$f":"(-3.194 - 0.13*D7 - 0.18)","v":-3.8940000000000001},1.173,{"$f":"1/2000","v":5.0000000000000001E-4},{"$f":"26.1","v":26.1},1,null,"Property damage only (PDO)",null,null,7700]
[null,null,null,null,"Ramp-exit",null,null,"Speed-change lane",null,{"$f":"(-2.679)","v":-2.6789999999999998},0.90300000000000002,{"$f":"1/2000","v":5.0000000000000001E-4},{"$f":"1.78","v":1.78},1,null,"Rate of return:",null,0.04]
[null,null,null,6,"Multiple-vehicle",null,null,"Freeway segment",null,{"$f":"(-5.587-0.505)","v":-6.0919999999999996},{"$f":"K7","v":1.492},1E-3,{"$f":"M7","v":17.600000000000001},1,null,"Year of crash cost:",null,2020,"Maximum:",{"$f":"YEAR(NOW())","v":2023}]
[null,null,null,null,"Single-vehicle",null,null,"Freeway segment",null,{"$f":"(-2.266+0.0351*D11)","v":-2.0554000000000001},0.64600000000000002,1E-3,30.1,1]
[null,null,null,null,"Ramp-entrance",null,null,"Speed-change lane",null,{"$f":"(-3.194 - 0.13*D11 - 0.18)","v":-4.1539999999999999},1.173,5.0000000000000001E-4,26.1,1]
[null,null,null,null,"Ramp-exit",null,null,"Speed-change lane",null,{"$f":"(-2.679)","v":-2.6789999999999998},0.90300000000000002,5.0000000000000001E-4,1.78,1]
[null,null,null,8,"Multiple-vehicle",null,null,"Freeway segment",null,{"$f":"(-5.635-0.505)","v":-6.14},1.492,1E-3,17.600000000000001,1]
[null,null,null,null,"Single-vehicle",null,null,"Freeway segment",null,{"$f":"(-2.266+0.0351*D15)","v":-1.9852000000000001},0.64600000000000002,1E-3,30.1,1]
[null,null,null,null,"Ramp-entrance",null,null,"Speed-change lane",null,{"$f":"(-3.194 - 0.13*D15 - 0.18)","v":-4.4139999999999997},1.173,5.0000000000000001E-4,26.1,1]
[null,null,null,null,"Ramp-exit",null,null,"Speed-change lane",null,{"$f":"(-2.679)","v":-2.6789999999999998},0.90300000000000002,5.0000000000000001E-4,1.78,1]
[null,"Urban",null,4,"Multiple-vehicle",null,null,"Freeway segment",null,{"$f":"(-5.47)","v":-5.47},1.492,1E-3,17.600000000000001,1]
[null,null,null,null,"Single-vehicle",null,null,"Freeway segment",null,{"$f":"(-2.266+0.0351*D19)","v":-2.1255999999999999},0.64600000000000002,1E-3,30.1,1]
[null,null,null,null,"Ramp-entrance",null,null,"Speed-change lane",null,{"$f":"(-3.194 - 0.13*D19 )","v":-3.714},1.173,5.0000000000000001E-4,26.1,1]
[null,null,null,null,"Ramp-exit",null,null,"Speed-change lane",null,{"$f":"(-2.679)","v":-2.6789999999999998},0.90300000000000002,5.0000000000000001E-4,1.78,1]
[null,null,null,6,"Multiple-vehicle",null,null,"Freeway segment",null,{"$f":"(-5.587)","v":-5.5869999999999997},1.492,1E-3,{"$f":"M19","v":17.600000000000001},1]
[null,null,null,null,"Single-vehicle",null,null,"Freeway segment",null,{"$f":"(-2.266+0.0351*D23)","v":-2.0554000000000001},0.64600000000000002,1E-3,30.1,1]
[null,null,null,null,"Ramp-entrance",null,null,"Speed-change lane",null,{"$f":"(-3.194 - 0.13*D23 )","v":-3.9740000000000002},1.173,5.0000000000000001E-4,26.1,1]
[null,null,null,null,"Ramp-exit",null,null,"Speed-change lane",null,{"$f":"(-2.679)","v":-2.6789999999999998},0.90300000000000002,5.0000000000000001E-4,1.78,1]
[null,null,null,8,"Multiple-vehicle",null,null,"Freeway segment",null,{"$f":"(-5.635)","v":-5.6349999999999998},1.492,1E-3,17.600000000000001,1]
[null,null,null,null,"Single-vehicle",null,null,"Freeway segment",null,{"$f":"(-2.266+0.0351*D27)","v":-1.9852000000000001},0.64600000000000002,1E-3,30.1,1]
[null,null,null,null,"Ramp-entrance",null,null,"Speed-change lane",null,{"$f":"(-3.194 - 0.13*D27 )","v":-4.234},1.173,5.0000000000000001E-4,26.1,1]
[null,null,null,null,"Ramp-exit",null,null,"Speed-change lane",null,{"$f":"(-2.679)","v":-2.6789999999999998},0.90300000000000002,5.0000000000000001E-4,1.78,1]
[null,null,null,10,"Multiple-vehicle",null,null,"Freeway segment",null,{"$f":"(-5.842)","v":-5.8419999999999996},1.492,1E-3,17.600000000000001,1]
[null,null,null,null,"Single-vehicle",null,null,"Freeway segment",null,{"$f":"(-2.266+0.0351*D31)","v":-1.915},0.64600000000000002,1E-3,30.1,1]
[null,null,null,null,"Ramp-entrance",null,null,"Speed-change lane",null,{"$f":"(-3.194 - 0.13*D31 )","v":-4.4939999999999998},1.173,5.0000000000000001E-4,26.1,1]
[null,null,null,null,"Ramp-exit",null,null,"Speed-change lane",null,{"$f":"(-2.679)","v":-2.6789999999999998},0.90300000000000002,5.0000000000000001E-4,1.78,1]
[null,"Freeway Property-Damage-Only Crash Frequency Models",null,null,null,null,null,null,null,"Model:   exp(a + b ln[c AADTfs]) L"]
[null,"Area Type",null,"Through Lanes","Model",null,null,"Location",null,"a","b","c","Inverse Disp. (K), mi","Calib. Factor (C)"]
[]
[null,"Rural",null,4,"Multiple-vehicle",null,null,"Freeway segment",null,{"$f":"(-6.355-0.332-0.193)","v":-6.88},1.9359999999999999,{"$f":"L7","v":1E-3},18.8,1]
[null,null,null,null,"Single-vehicle",null,null,"Freeway segment",null,{"$f":"(-1.955-0.0193*D38-0.203)","v":-2.2351999999999999},0.876,{"$f":"L8","v":1E-3},20.7,1]
[null,null,null,null,"Ramp-entrance",null,null,"Speed-change lane",null,{"$f":"-2.18-0.101*D38-0.0989-0.212","v":-2.8949000000000003},1.2150000000000001,{"$f":"L9","v":5.0000000000000001E-4},24.8,1]
[null,null,null,null,"Ramp-exit",null,null,"Speed-change lane",null,{"$f":"-1.575-0.223","v":-1.798},0.93200000000000005,{"$f":"L10","v":5.0000000000000001E-4},1.58,1]
[null,null,null,6,"Multiple-vehicle",null,null,"Freeway segment",null,{"$f":"(-6.616-0.332-0.193)","v":-7.1409999999999991},{"$f":"K38","v":1.9359999999999999},1E-3,18.8,1]
[null,null,null,null,"Single-vehicle",null,null,"Freeway segment",null,{"$f":"(-1.955-0.0193*D42-0.203)","v":-2.2738},0.876,1E-3,20.7,1]
[null,null,null,null,"Ramp-entrance",null,null,"Speed-change lane",null,{"$f":"-2.18-0.101*D42-0.0989-0.212","v":-3.0969000000000007},1.2150000000000001,5.0000000000000001E-4,24.8,1]
[null,null,null,null,"Ramp-exit",null,null,"Speed-change lane",null,{"$f":"-1.575-0.223","v":-1.798},0.93200000000000005,5.0000000000000001E-4,1.58,1]
[null,null,null,8,"Multiple-vehicle",null,null,"Freeway segment",null,{"$f":"(-6.804-0.332-0.193)","v":-7.3289999999999997},1.9359999999999999,1E-3,18.8,1]
[null,null,null,null,"Single-vehicle",null,null,"Freeway segment",null,{"$f":"(-1.955-0.0193*D46-0.203)","v":-2.3123999999999998},0.876,1E-3,20.7,1]
[null,null,null,null,"Ramp-entrance",null,null,"Speed-change lane",null,{"$f":"-2.18-0.101*D46-0.0989-0.212","v":-3.2989000000000006},{"$f":"K44","v":1.2150000000000001},5.0000000000000001E-4,24.8,1]
[null,null,null,null,"Ramp-exit",null,null,"Speed-change lane",null,{"$f":"-1.575-0.223","v":-1.798},{"$f":"K45","v":0.93200000000000005},5.0000000000000001E-4,1.58,1]
[null,"Urban",null,4,"Multiple-vehicle",null,null,"Freeway segment",null,{"$f":"(-6.355-0-0.193)","v":-6.548},1.9359999999999999,1E-3,18.8,{"$f":"N46","v":1}]
[null,null,null,null,"Single-vehicle",null,null,"Freeway segment",null,{"$f":"(-1.955-0.0193*D50-0.203)","v":-2.2351999999999999},0.876,1E-3,20.7,{"$f":"N47","v":1}]
[null,null,null,null,"Ramp-entrance",null,null,"Speed-change lane",null,{"$f":"-2.18-0.101*D50-0-0.212","v":-2.7960000000000003},{"$f":"K48","v":1.2150000000000001},5.0000000000000001E-4,24.8,1]
[null,null,null,null,"Ramp-exit",null,null,"Speed-change lane",null,{"$f":"-1.575-0.223","v":-1.798},{"$f":"K49","v":0.93200000000000005},5.0000000000000001E-4,1.58,1]
[null,null,null,6,"Multiple-vehicle",null,null,"Freeway segment",null,{"$f":"(-6.616-0-0.193)","v":-6.8089999999999993},1.9359999999999999,1E-3,18.8,{"$f":"N50","v":1}]
[null,null,null,null,"Single-vehicle",null,null,"Freeway segment",null,{"$f":"(-1.955-0.0193*D54-0.203)","v":-2.2738},0.876,1E-3,20.7,{"$f":"N51","v":1}]
[null,null,null,null,"Ramp-entrance",null,null,"Speed-change lane",null,{"$f":"-2.18-0.101*D54-0-0.212","v":-2.9980000000000007},{"$f":"K52","v":1.2150000000000001},5.0000000000000001E-4,24.8,1]
[null,null,null,null,"Ramp-exit",null,null,"Speed-change lane",null,{"$f":"-1.575-0.223","v":-1.798},{"$f":"K53","v":0.93200000000000005},5.0000000000000001E-4,1.58,1]
[null,null,null,8,"Multiple-vehicle",null,null,"Freeway segment",null,{"$f":"(-6.804-0-0.193)","v":-6.9969999999999999},1.9359999999999999,1E-3,18.8,{"$f":"N54","v":1}]
[null,null,null,null,"Single-vehicle",null,null,"Freeway segment",null,{"$f":"(-1.955-0.0193*D58-0.203)","v":-2.3123999999999998},0.876,1E-3,20.7,{"$f":"N55","v":1}]
[null,null,null,null,"Ramp-entrance",null,null,"Speed-change lane",null,{"$f":"-2.18-0.101*D58-0-0.212","v":-3.2000000000000006},{"$f":"K56","v":1.2150000000000001},5.0000000000000001E-4,24.8,1]
[null,null,null,null,"Ramp-exit",null,null,"Speed-change lane",null,{"$f":"-1.575-0.223","v":-1.798},{"$f":"K57","v":0.93200000000000005},5.0000000000000001E-4,1.58,1]
[null,null,null,10,"Multiple-vehicle",null,null,"Freeway segment",null,{"$f":"(-7.067-0-0.193)","v":-7.26},1.9359999999999999,1E-3,18.8,{"$f":"N58","v":1}]
[null,null,null,null,"Single-vehicle",null,null,"Freeway segment",null,{"$f":"(-1.955-0.0193*D62-0.203)","v":-2.351},0.876,1E-3,20.7,{"$f":"N59","v":1}]
[null,null,null,null,"Ramp-entrance",null,null,"Speed-change lane",null,{"$f":"-2.18-0.101*D62-0-0.212","v":-3.4020000000000006},{"$f":"K60","v":1.2150000000000001},5.0000000000000001E-4,24.8,1]
[null,null,null,null,"Ramp-exit",null,null,"Speed-change lane",null,{"$f":"-1.575-0.223","v":-1.798},{"$f":"K61","v":0.93200000000000005},{"$f":"L61","v":5.0000000000000001E-4},{"$f":"M61","v":1.58},1]
[null,"Freeway Crash Severity Model"]
[null,null,null,null,null,null,null,null,null,null,null,"Calibration factor",null,1]
[null,"Freeway Crash Distribution"]
[null,"Area Type",null,"Crash Type",null,"Crash Type Category",null,null,"Proportion of Crashes by Severity Level for Specific Models"]
[null,null,null,null,null,null,null,null,"Main Lanes",null,"Ramp Entrance",null,"Ramp Exit"]
[null,null,null,null,null,null,null,null,"FI","PDO","FI","PDO","FI","PDO"]
[null,"Rural",null,"Multiple vehicle",null,"Head-on",null,null,1.7999999999999999E-2,4.0000000000000001E-3,2.1000000000000001E-2,4.0000000000000001E-3,0,0]
[null,null,null,null,null,"Right-angle",null,null,5.6000000000000001E-2,0.03,3.2000000000000001E-2,1.2999999999999999E-2,1.4999999999999999E-2,0]
[null,null,null,null,null,"Rear-end",null,null,0.63,0.50800000000000001,0.35099999999999998,0.26,0.46300000000000002,0.30399999999999999]
[null,null,null,null,null,"Sideswipe",null,null,0.23699999999999999,0.38,0.128,0.24199999999999999,0.104,0.24299999999999999]
[null,null,null,null,null,"Other multiple-vehicle crash",null,null,5.8999999999999997E-2,7.8E-2,1.0999999999999999E-2,0.04,0,8.9999999999999993E-3]
[null,null,null,null,null,null,null,"MV Total:",{"$f":"SUM(I72:I76)","v":1},{"$f":"SUM(J72:J76)","v":1}]
[null,null,null,"Single vehicle",null,"Crash with animal",null,null,0.01,6.5000000000000002E-2,0,8.9999999999999993E-3,0,6.0999999999999999E-2]
[null,null,null,null,null,"Crash with fixed object",null,null,0.56699999999999995,0.625,0.245,0.29599999999999999,0.224,0.23499999999999999]
[null,null,null,null,null,"Crash with other object",null,null,3.1E-2,0.125,2.1000000000000001E-2,7.0000000000000007E-2,0.03,6.0999999999999999E-2]
[null,null,null,null,null,"Crash with parked vehicle",null,null,2.4E-2,2.3E-2,2.1000000000000001E-2,0,0,1.7000000000000001E-2]
[null,null,null,null,null,"Other single-vehicle crash",null,null,0.36799999999999999,0.16200000000000001,0.17,6.6000000000000003E-2,0.16400000000000001,7.0000000000000007E-2]
[null,null,null,null,null,null,null,"SV Total:",{"$f":"SUM(I78:I82)","v":1},{"$f":"SUM(J78:J82)","v":1}]
[null,null,null,null,null,null,null,"Total:",null,null,{"$f":"SUM(K78:K82)+SUM(K72:K76)","v":1},{"$f":"SUM(L78:L82)+SUM(L72:L76)","v":1},{"$f":"SUM(M78:M82)+SUM(M72:M76)","v":1},{"$f":"SUM(N78:N82)+SUM(N72:N76)","v":1}]
[null,"Urban",null,"Multiple vehicle",null,"Head-on",null,null,8.0000000000000002E-3,2E-3,4.0000000000000001E-3,1E-3,5.0000000000000001E-3,2E-3]
[null,null,null,null,null,"Right-angle",null,null,3.1E-2,1.7999999999999999E-2,1.9E-2,1.6E-2,1.0999999999999999E-2,1.2E-2]
[null,null,null,null,null,"Rear-end",null,null,0.75,0.69,0.54300000000000004,0.53,0.54900000000000004,0.56499999999999995]
[null,null,null,null,null,"Sideswipe",null,null,0.18,0.26600000000000001,0.13300000000000001,0.252,0.158,0.13800000000000001]
[null,null,null,null,null,"Other multiple-vehicle crash",null,null,3.1E-2,2.4E-2,1.7000000000000001E-2,1.4999999999999999E-2,1.6E-2,1.6E-2]
[null,null,null,null,null,null,null,"MV Total:",{"$f":"SUM(I85:I89)","v":1},{"$f":"SUM(J85:J89)","v":1}]
[null,null,null,"Single vehicle",null,"Crash with animal",null,null,4.0000000000000001E-3,2.1999999999999999E-2,0,2E-3,0,7.0000000000000001E-3]
[null,null,null,null,null,"Crash with fixed object",null,null,0.72199999999999998,0.71599999999999997,0.19400000000000001,0.129,0.19600000000000001,0.20699999999999999]
[null,null,null,null,null,"Crash with other object",null,null,5.0999999999999997E-2,0.13900000000000001,1.9E-2,3.5999999999999997E-2,1.6E-2,0.03]
[null,null,null,null,null,"Crash with parked vehicle",null,null,1.4999999999999999E-2,1.6E-2,4.0000000000000001E-3,3.0000000000000001E-3,0,0]
[null,null,null,null,null,"Other single-vehicle crash",null,null,0.20799999999999999,0.107,6.7000000000000004E-2,1.6E-2,4.9000000000000002E-2,2.3E-2]
[null,null,null,null,null,null,null,"SV Total:",{"$f":"SUM(I91:I95)","v":1},{"$f":"SUM(J91:J95)","v":1}]
[null,null,null,null,null,null,null,"Total:",null,null,{"$f":"SUM(K91:K95)+SUM(K85:K89)","v":1},{"$f":"SUM(L91:L95)+SUM(L85:L89)","v":1},{"$f":"SUM(M91:M95)+SUM(M85:M89)","v":1},{"$f":"SUM(N91:N95)+SUM(N85:N89)","v":1}]
[]
[]
[null,"Ramp Segment Model Calibration Factors and Default Values"]
[null,"Ramp Segment Fatal-and-Injury Crash Frequency Models",null,null,null,null,null,null,"Model:   exp(a + b ln[c AADTr] + d [c AADTr]) L"]
[null,"Area Type",null,"Through Lanes","Number of Vehicles Involved",null,null,"Location","a","b","c","d","Inverse Disp. (K), mi","Calib. Factor (C)"]
[]
[null,"Rural",null,1,"Multiple vehicle",null,null,"Entrance",{"$f":"(-2.997-0.508-1.721)","v":-5.226},0.52400000000000002,1E-3,6.9900000000000004E-2,{"$f":"14.6","v":14.6},1]
[null,null,null,null,"Multiple vehicle",null,null,"Exit",{"$f":"(-2.997-1.974-1.721)","v":-6.6920000000000002},0.52400000000000002,1E-3,6.9900000000000004E-2,{"$f":"14.6","v":14.6},1]
[null,null,null,null,"Multiple vehicle",null,null,"C-D road",{"$f":"(-2.997-0-1.721)","v":-4.718},0.52400000000000002,1E-3,6.9900000000000004E-2,{"$f":"14.6","v":14.6},1]
[null,null,null,null,"Single vehicle",null,null,"Entrance",{"$f":"(-2.848+0.882-0.154)","v":-2.1199999999999997},0.71799999999999997,1E-3,0,{"$f":"7.91","v":7.91},1]
[null,null,null,null,"Single vehicle",null,null,"Exit",{"$f":"(-2.848+1.203-0.154)","v":-1.7989999999999997},0.71799999999999997,1E-3,0,{"$f":"7.91","v":7.91},1]
[null,null,null,null,"Single vehicle",null,null,"C-D road",{"$f":"(-2.848+0-0.154)","v":-3.0019999999999998},0.71799999999999997,1E-3,0,{"$f":"7.91","v":7.91},1]
[null,"Urban",null,1,"Multiple vehicle",null,null,"Entrance",{"$f":"(-2.997-0.508-0)","v":-3.5049999999999999},{"$f":"J104","v":0.52400000000000002},1E-3,6.9900000000000004E-2,14.6,1]
[null,null,null,null,"Multiple vehicle",null,null,"Exit",{"$f":"(-2.997-1.974-0)","v":-4.9710000000000001},0.52400000000000002,1E-3,6.9900000000000004E-2,14.6,1]
[null,null,null,null,"Multiple vehicle",null,null,"C-D road",{"$f":"(-2.997-0-0)","v":-2.9969999999999999},0.52400000000000002,1E-3,6.9900000000000004E-2,14.6,1]
[null,null,null,null,"Single vehicle",null,null,"Entrance",{"$f":"(-2.848+0.882-0)","v":-1.9659999999999997},0.71799999999999997,1E-3,0,7.91,1]
[null,null,null,null,"Single vehicle",null,null,"Exit",{"$f":"(-2.848+1.203-0)","v":-1.6449999999999998},0.71799999999999997,1E-3,0,7.91,1]
[null,null,null,null,"Single vehicle",null,null,"C-D road",{"$f":"(-2.848+0-0)","v":-2.8479999999999999},0.71799999999999997,1E-3,0,7.91,1]
[null,null,null,2,"Multiple vehicle",null,null,"Entrance",{"$f":"(-2.515-0.508-0)","v":-3.0230000000000001},0.52400000000000002,1E-3,6.9900000000000004E-2,14.6,1]
[null,null,null,null,"Multiple vehicle",null,null,"Exit",{"$f":"(-2.515-1.974-0)","v":-4.4889999999999999},0.52400000000000002,1E-3,6.9900000000000004E-2,14.6,1]
[null,null,null,null,"Multiple vehicle",null,null,"C-D road",{"$f":"(-2.515-0-0)","v":-2.5150000000000001},0.52400000000000002,1E-3,6.9900000000000004E-2,14.6,1]
[null,null,null,null,"Single vehicle",null,null,"Entrance",{"$f":"(-2.881+0.882-0)","v":-1.9989999999999997},0.71799999999999997,1E-3,0,7.91,1]
[null,null,null,null,"Single vehicle",null,null,"Exit",{"$f":"(-2.881+1.203-0)","v":-1.6779999999999997},0.71799999999999997,1E-3,0,7.91,1]
[null,null,null,null,"Single vehicle",null,null,"C-D road",{"$f":"(-2.881+0-0)","v":-2.8809999999999998},0.71799999999999997,1E-3,0,7.91,1]
[null,"Ramp Segment Property-Damage-Only Crash Frequency Models",null,null,null,null,null,null,"Model:   exp(a + b ln[c AADTr] + d [c AADTr]) L"]
[null,"Area Type",null,"Through Lanes","Number of Vehicles Involved",null,null,"Location","a","b","c","d","Inverse Disp. (K), mi","Calib. Factor (C)"]
[]
[null,"Rural",null,1,"Multiple vehicle",null,null,"Entrance",{"$f":"(-3.311-0.508)","v":-3.819},1.256,1E-3,0,12.7,1]
[null,null,null,null,"Multiple vehicle",null,null,"Exit",{"$f":"(-3.311-1.54)","v":-4.851},1.256,1E-3,0,12.7,1]
[null,null,null,null,"Multiple vehicle",null,null,"C-D road",{"$f":"(-3.311-0)","v":-3.3109999999999999},1.256,1E-3,0,12.7,1]
[null,null,null,null,"Single vehicle",null,null,"Entrance",{"$f":"(-2.659+0.944-0.231)","v":-1.946},0.68899999999999995,1E-3,0,9.77,1]
[null,null,null,null,"Single vehicle",null,null,"Exit",{"$f":"(-2.659+1.151-0.231)","v":-1.7389999999999999},0.68899999999999995,1E-3,0,9.77,1]
[null,null,null,null,"Single vehicle",null,null,"C-D road",{"$f":"(-2.659+0-0.231)","v":-2.8899999999999997},0.68899999999999995,1E-3,0,9.77,1]
[null,"Urban",null,1,"Multiple vehicle",null,null,"Entrance",{"$f":"(-3.311-0.508)","v":-3.819},{"$f":"J125","v":1.256},1E-3,0,12.7,1]
[null,null,null,null,"Multiple vehicle",null,null,"Exit",{"$f":"(-3.311-1.54)","v":-4.851},1.256,1E-3,0,12.7,1]
[null,null,null,null,"Multiple vehicle",null,null,"C-D road",{"$f":"(-3.311-0)","v":-3.3109999999999999},1.256,1E-3,0,12.7,1]
[null,null,null,null,"Single vehicle",null,null,"Entrance",{"$f":"(-2.659+0.944-0)","v":-1.7149999999999999},0.68899999999999995,1E-3,0,9.77,1]
[null,null,null,null,"Single vehicle",null,null,"Exit",{"$f":"(-2.659+1.151-0)","v":-1.5079999999999998},0.68899999999999995,1E-3,0,9.77,1]
[null,null,null,null,"Single vehicle",null,null,"C-D road",{"$f":"(-2.659+0-0)","v":-2.6589999999999998},0.68899999999999995,1E-3,0,9.77,1]
[null,null,null,2,"Multiple vehicle",null,null,"Entrance",{"$f":"(-2.475-0.508)","v":-2.9830000000000001},1.256,1E-3,0,12.7,1]
[null,null,null,null,"Multiple vehicle",null,null,"Exit",{"$f":"(-2.475-1.54)","v":-4.0150000000000006},1.256,1E-3,0,12.7,1]
[null,null,null,null,"Multiple vehicle",null,null,"C-D road",{"$f":"(-2.475-0)","v":-2.4750000000000001},1.256,1E-3,0,12.7,1]
[null,null,null,null,"Single vehicle",null,null,"Entrance",{"$f":"(-2.344+0.944-0)","v":-1.4},0.68899999999999995,1E-3,0,9.77,1]
[null,null,null,null,"Single vehicle",null,null,"Exit",{"$f":"(-2.344+1.151-0)","v":-1.1929999999999998},0.68899999999999995,1E-3,0,9.77,1]
[null,null,null,null,"Single vehicle",null,null,"C-D road",{"$f":"(-2.344+0-0)","v":-2.3439999999999999},0.68899999999999995,1E-3,0,9.77,1]
[null,"Ramp Segment Crash Severity Model"]
[null,null,null,null,null,null,null,null,null,null,null,"Calibration factor",null,1]
[null,"Ramp Segment Crash Distribution"]
[null,"Area Type",null,"Crash Type",null,"Crash Type Category",null,null,"Proportion of Crashes by Severity Level for Specific Models"]
[null,null,null,null,null,null,null,null,"C-D Road",null,"Entrance Ramp",null,"Exit Ramp"]
[null,null,null,null,null,null,null,null,"FI","PDO","FI","PDO","FI","PDO"]
[null,"Rural",null,"Multiple vehicle",null,"Head-on",null,null,{"$f":"I162","v":1.4999999999999999E-2},8.9999999999999993E-3,{"$f":"I149","v":1.4999999999999999E-2},8.9999999999999993E-3,{"$f":"I149","v":1.4999999999999999E-2},8.9999999999999993E-3]
[null,null,null,null,null,"Right-angle",null,null,0.01,5.0000000000000001E-3,0.01,5.0000000000000001E-3,0.01,5.0000000000000001E-3]
[null,null,null,null,null,"Rear-end",null,null,0.70699999999999996,0.55000000000000004,0.70699999999999996,0.55000000000000004,0.70699999999999996,0.55000000000000004]
[null,null,null,null,null,"Sideswipe",null,null,0.129,0.33500000000000002,0.129,0.33500000000000002,0.129,0.33500000000000002]
[null,null,null,null,null,"Other multiple-vehicle crash",null,null,0.13900000000000001,0.10100000000000001,0.13900000000000001,0.10100000000000001,0.13900000000000001,0.10100000000000001]
[null,null,null,null,null,null,null,"MV Total:",{"$f":"SUM(I149:I153)","v":1},1,1,1,1,1]
[null,null,null,"Single vehicle",null,"Crash with animal",null,null,1.2E-2,2.1999999999999999E-2,{"$f":"I155","v":1.2E-2},2.1999999999999999E-2,{"$f":"I155","v":1.2E-2},2.1999999999999999E-2]
[null,null,null,null,null,"Crash with fixed object",null,null,0.42199999999999999,0.53800000000000003,0.42199999999999999,0.53800000000000003,0.42199999999999999,0.53800000000000003]
[null,null,null,null,null,"Crash with other object",null,null,0,1.0999999999999999E-2,0,1.0999999999999999E-2,0,1.0999999999999999E-2]
[null,null,null,null,null,"Crash with parked vehicle",null,null,2.4E-2,5.5E-2,2.4E-2,5.5E-2,2.4E-2,5.5E-2]
[null,null,null,null,null,"Other single-vehicle crash",null,null,0.54200000000000004,0.374,0.54200000000000004,0.374,0.54200000000000004,0.374]
[null,null,null,null,null,null,null,"SV Total:",{"$f":"SUM(I155:I159)","v":1},1,1,1,1,1]
[]
[null,"Urban",null,"Multiple vehicle",null,"Head-on",null,null,1.4999999999999999E-2,8.9999999999999993E-3,{"$f":"I162","v":1.4999999999999999E-2},8.9999999999999993E-3,{"$f":"I162","v":1.4999999999999999E-2},8.9999999999999993E-3]
[null,null,null,null,null,"Right-angle",null,null,0.01,5.0000000000000001E-3,0.01,5.0000000000000001E-3,0.01,5.0000000000000001E-3]
[null,null,null,null,null,"Rear-end",null,null,0.70699999999999996,0.55000000000000004,0.70699999999999996,0.55000000000000004,0.70699999999999996,0.55000000000000004]
[null,null,null,null,null,"Sideswipe",null,null,0.129,0.33500000000000002,0.129,0.33500000000000002,0.129,0.33500000000000002]
[null,null,null,null,null,"Other multiple-vehicle crash",null,null,0.13900000000000001,0.10100000000000001,0.13900000000000001,0.10100000000000001,0.13900000000000001,0.10100000000000001]
[null,null,null,null,null,null,null,"MV Total:",{"$f":"SUM(I162:I166)","v":1},1,1,1,1,1]
[null,null,null,"Single vehicle",null,"Crash with animal",null,null,3.0000000000000001E-3,5.0000000000000001E-3,{"$f":"I168","v":3.0000000000000001E-3},{"$f":"J168","v":5.0000000000000001E-3},{"$f":"I168","v":3.0000000000000001E-3},5.0000000000000001E-3]
[null,null,null,null,null,"Crash with fixed object",null,null,0.71799999999999997,0.83399999999999996,{"$f":"I169","v":0.71799999999999997},{"$f":"J169","v":0.83399999999999996},0.71799999999999997,0.83399999999999996]
[null,null,null,null,null,"Crash with other object",null,null,1.4999999999999999E-2,2.3E-2,{"$f":"I170","v":1.4999999999999999E-2},2.3E-2,1.4999999999999999E-2,2.3E-2]
[null,null,null,null,null,"Crash with parked vehicle",null,null,1.2E-2,1.2E-2,1.2E-2,1.2E-2,1.2E-2,1.2E-2]
[null,null,null,null,null,"Other single-vehicle crash",null,null,0.252,0.126,0.252,0.126,0.252,0.126]
[null,null,null,null,null,null,null,"SV Total:",{"$f":"SUM(I168:I172)","v":1},1,1,1,1,1]
[]
[]
[]
[null,"Ramp Terminal Model Calibration Factors and Default Values"]
[null,"Ramp Terminal Fatal-and-Injury Crash Frequency Models",null,null,null,null,null,"Model: exp(a + b ln[c AADTin/2 + c AADTout/2] + d ln[c AADTex + c AADTen])"]
[null,"Area Type",null,"Terminal Config.","Control Type",null,"Through Lanes",null,"a","b","c","d","Inverse Disp. (K)","Calib. Factor (C)"]
[]
[null,"Rural",null,"D3ex","One-way stop",null,null,2,{"$f":"-3.223+0.324","v":-2.899},0.58199999999999996,1E-3,0.89900000000000002,2.16,1]
[null,null,null,null,null,null,null,3,{"$f":"-3.223+0.324","v":-2.899},0.58199999999999996,1E-3,0.89900000000000002,2.16,{"$f":"N181","v":1}]
[null,null,null,null,null,null,null,4,{"$f":"-3.223+0.324","v":-2.899},0.58199999999999996,1E-3,0.89900000000000002,2.16,{"$f":"N182","v":1}]
[null,null,null,null,"Signalized",null,null,2,{"$f":"-1.672+0.16*H184","v":-1.3519999999999999},0.379,1E-3,0.39400000000000002,8.7200000000000006,1]
[null,null,null,null,null,null,null,3,{"$f":"-1.672+0.16*H185","v":-1.1919999999999999},0.379,1E-3,0.39400000000000002,8.7200000000000006,{"$f":"N184","v":1}]
[null,null,null,null,null,null,null,4,{"$f":"-1.672+0.16*H186","v":-1.032},0.379,1E-3,0.39400000000000002,8.7200000000000006,{"$f":"N185","v":1}]
[null,null,null,"D3en","One-way stop",null,null,2,{"$f":"-3.141+0.324","v":-2.8170000000000002},0.70899999999999996,1E-3,0.73,0.91800000000000004,{"$f":"N181","v":1}]
[null,null,null,null,null,null,null,3,{"$f":"-3.141+0.324","v":-2.8170000000000002},0.70899999999999996,1E-3,0.73,0.91800000000000004,{"$f":"N182","v":1}]
[null,null,null,null,null,null,null,4,{"$f":"-3.141+0.324","v":-2.8170000000000002},0.70899999999999996,1E-3,0.73,0.91800000000000004,1]
[null,null,null,null,"Signalized",null,null,2,{"$f":"-2.388+0.16*H190","v":-2.0680000000000001},0.26500000000000001,1E-3,0.90500000000000003,5.37,1]
[null,null,null,null,null,null,null,3,{"$f":"-2.388+0.16*H191","v":-1.9079999999999999},0.26500000000000001,1E-3,0.90500000000000003,5.37,1]
[null,null,null,null,null,null,null,4,{"$f":"-2.388+0.16*H192","v":-1.7479999999999998},0.26500000000000001,1E-3,0.90500000000000003,5.37,1]
[null,null,null,"D4","One-way stop",null,null,2,{"$f":"-3.064+0.324","v":-2.74},1.008,1E-3,0.17699999999999999,2.58,{"$f":"N187","v":1}]
[null,null,null,null,null,null,null,3,{"$f":"-3.064+0.324","v":-2.74},1.008,1E-3,0.17699999999999999,2.58,1]
[null,null,null,null,null,null,null,4,{"$f":"-3.064+0.324","v":-2.74},1.008,1E-3,0.17699999999999999,2.58,1]
[null,null,null,null,"Signalized",null,null,2,{"$f":"-2.975+0.16*H196","v":-2.6550000000000002},1.1910000000000001,1E-3,0.13100000000000001,11.5,1]
[null,null,null,null,null,null,null,3,{"$f":"-2.975+0.16*H197","v":-2.4950000000000001},1.1910000000000001,1E-3,0.13100000000000001,11.5,1]
[null,null,null,null,null,null,null,4,{"$f":"-2.975+0.16*H198","v":-2.335},1.1910000000000001,1E-3,0.13100000000000001,11.5,1]
[null,null,null,"A4","One-way stop",null,null,2,{"$f":"-3.223+0.324","v":-2.899},0.58199999999999996,1E-3,0.89900000000000002,2.16,{"$f":"N193","v":1}]
[null,null,null,null,null,null,null,3,{"$f":"-3.223+0.324","v":-2.899},0.58199999999999996,1E-3,0.89900000000000002,2.16,1]
[null,null,null,null,null,null,null,4,{"$f":"-3.223+0.324","v":-2.899},0.58199999999999996,1E-3,0.89900000000000002,2.16,1]
[null,null,null,null,"Signalized",null,null,2,{"$f":"-1.672+0.16*H202","v":-1.3519999999999999},0.379,1E-3,0.39400000000000002,8.7200000000000006,1]
[null,null,null,null,null,null,null,3,{"$f":"-1.672+0.16*H203","v":-1.1919999999999999},0.379,1E-3,0.39400000000000002,8.7200000000000006,1]
[null,null,null,null,null,null,null,4,{"$f":"-1.672+0.16*H204","v":-1.032},0.379,1E-3,0.39400000000000002,8.7200000000000006,1]
[null,null,null,"B4","One-way stop",null,null,2,{"$f":"-3.141+0.324","v":-2.8170000000000002},0.70899999999999996,1E-3,0.73,0.91800000000000004,{"$f":"N199","v":1}]
[null,null,null,null,null,null,null,3,{"$f":"-3.141+0.324","v":-2.8170000000000002},0.70899999999999996,1E-3,0.73,0.91800000000000004,1]
[null,null,null,null,null,null,null,4,{"$f":"-3.141+0.324","v":-2.8170000000000002},0.70899999999999996,1E-3,0.73,0.91800000000000004,1]
[null,null,null,null,"Signalized",null,null,2,{"$f":"-2.388+0.16*H208","v":-2.0680000000000001},0.26500000000000001,1E-3,0.90500000000000003,5.37,1]
[null,null,null,null,null,null,null,3,{"$f":"-2.388+0.16*H209","v":-1.9079999999999999},0.26500000000000001,1E-3,0.90500000000000003,5.37,1]
[null,null,null,null,null,null,null,4,{"$f":"-2.388+0.16*H210","v":-1.7479999999999998},0.26500000000000001,1E-3,0.90500000000000003,5.37,1]
[null,null,null,"A2","One-way stop",null,null,2,{"$f":"-2.687+0.324","v":-2.363},0.26,1E-3,0.94699999999999995,3.4,{"$f":"N205","v":1}]
[null,null,null,null,null,null,null,3,{"$f":"-2.687+0.324","v":-2.363},0.26,1E-3,0.94699999999999995,3.4,1]
[null,null,null,null,null,null,null,4,{"$f":"-2.687+0.324","v":-2.363},0.26,1E-3,0.94699999999999995,3.4,1]
[null,null,null,null,"Signalized",null,null,2,{"$f":"-0.778+0.16*H214","v":-0.45800000000000002},0.32500000000000001,1E-3,0.21199999999999999,2.17,1]
[null,null,null,null,null,null,null,3,{"$f":"-0.778+0.16*H215","v":-0.29800000000000004},0.32500000000000001,1E-3,0.21199999999999999,2.17,1]
[null,null,null,null,null,null,null,4,{"$f":"-0.778+0.16*H216","v":-0.13800000000000001},0.32500000000000001,1E-3,0.21199999999999999,2.17,1]
[null,null,null,"B2","One-way stop",null,null,2,{"$f":"-2.687+0.324","v":-2.363},0.26,1E-3,0.94699999999999995,3.4,{"$f":"N211","v":1}]
[null,null,null,null,null,null,null,3,{"$f":"-2.687+0.324","v":-2.363},0.26,1E-3,0.94699999999999995,3.4,1]
[null,null,null,null,null,null,null,4,{"$f":"-2.687+0.324","v":-2.363},0.26,1E-3,0.94699999999999995,3.4,1]
[null,null,null,null,"Signalized",null,null,2,{"$f":"-0.778+0.16*H220","v":-0.45800000000000002},0.32500000000000001,1E-3,0.21199999999999999,2.17,1]
[null,null,null,null,null,null,null,3,{"$f":"-0.778+0.16*H221","v":-0.29800000000000004},0.32500000000000001,1E-3,0.21199999999999999,2.17,1]
[null,null,null,null,null,null,null,4,{"$f":"-0.778+0.16*H222","v":-0.13800000000000001},0.32500000000000001,1E-3,0.21199999999999999,2.17,1]
[null,"Urban",null,"D3ex","One-way stop",null,null,2,{"$f":"-3.223+0","v":-3.2229999999999999},0.58199999999999996,1E-3,0.89900000000000002,2.16,{"$f":"N181","v":1}]
[null,null,null,null,null,null,null,3,{"$f":"-3.223+0","v":-3.2229999999999999},0.58199999999999996,1E-3,0.89900000000000002,2.16,{"$f":"N223","v":1}]
[null,null,null,null,null,null,null,4,{"$f":"-3.223+0","v":-3.2229999999999999},0.58199999999999996,1E-3,0.89900000000000002,2.16,1]
[null,null,null,null,"Signalized",null,null,2,{"$f":"-1.672+0.16*H226","v":-1.3519999999999999},0.379,1E-3,0.39400000000000002,8.7200000000000006,{"$f":"N184","v":1}]
[null,null,null,null,null,null,null,3,{"$f":"-1.672+0.16*H227","v":-1.1919999999999999},0.379,1E-3,0.39400000000000002,8.7200000000000006,1]
[null,null,null,null,null,null,null,4,{"$f":"-1.672+0.16*H228","v":-1.032},0.379,1E-3,0.39400000000000002,8.7200000000000006,1]
[null,null,null,null,null,null,null,5,{"$f":"-1.672+0.16*H229","v":-0.87199999999999989},0.379,1E-3,0.39400000000000002,8.7200000000000006,1]
[null,null,null,null,null,null,null,6,{"$f":"-1.672+0.16*H230","v":-0.71199999999999997},0.379,1E-3,0.39400000000000002,8.7200000000000006,1]
[null,null,null,"D3en","One-way stop",null,null,2,{"$f":"-3.141+0","v":-3.141},0.70899999999999996,1E-3,0.73,0.91800000000000004,{"$f":"N223","v":1}]
[null,null,null,null,null,null,null,3,{"$f":"-3.141+0","v":-3.141},0.70899999999999996,1E-3,0.73,0.91800000000000004,{"$f":"N224","v":1}]
[null,null,null,null,null,null,null,4,{"$f":"-3.141+0","v":-3.141},0.70899999999999996,1E-3,0.73,0.91800000000000004,{"$f":"N225","v":1}]
[null,null,null,null,"Signalized",null,null,2,{"$f":"-2.388+0.16*H234","v":-2.0680000000000001},0.26500000000000001,1E-3,0.90500000000000003,5.37,{"$f":"N226","v":1}]
[null,null,null,null,null,null,null,3,{"$f":"-2.388+0.16*H235","v":-1.9079999999999999},0.26500000000000001,1E-3,0.90500000000000003,5.37,{"$f":"N234","v":1}]
[null,null,null,null,null,null,null,4,{"$f":"-2.388+0.16*H236","v":-1.7479999999999998},0.26500000000000001,1E-3,0.90500000000000003,5.37,{"$f":"N235","v":1}]
[null,null,null,null,null,null,null,5,{"$f":"-2.388+0.16*H237","v":-1.5879999999999999},0.26500000000000001,1E-3,0.90500000000000003,5.37,{"$f":"N236","v":1}]
[null,null,null,null,null,null,null,6,{"$f":"-2.388+0.16*H238","v":-1.4279999999999999},0.26500000000000001,1E-3,0.90500000000000003,5.37,{"$f":"N237","v":1}]
[null,null,null,"D4","One-way stop",null,null,2,{"$f":"-3.064+0","v":-3.0640000000000001},1.008,1E-3,0.17699999999999999,2.58,{"$f":"N231","v":1}]
[null,null,null,null,null,null,null,3,{"$f":"-3.064+0","v":-3.0640000000000001},1.008,1E-3,0.17699999999999999,2.58,{"$f":"N232","v":1}]
[null,null,null,null,null,null,null,4,{"$f":"-3.064+0","v":-3.0640000000000001},1.008,1E-3,0.17699999999999999,2.58,{"$f":"N233","v":1}]
[null,null,null,null,"Signalized",null,null,2,{"$f":"-2.975+0.16*H242","v":-2.6550000000000002},1.1910000000000001,1E-3,0.13100000000000001,11.5,{"$f":"N234","v":1}]
[null,null,null,null,null,null,null,3,{"$f":"-2.975+0.16*H243","v":-2.4950000000000001},1.1910000000000001,1E-3,0.13100000000000001,11.5,{"$f":"N242","v":1}]
[null,null,null,null,null,null,null,4,{"$f":"-2.975+0.16*H244","v":-2.335},1.1910000000000001,1E-3,0.13100000000000001,11.5,{"$f":"N243","v":1}]
[null,null,null,null,null,null,null,5,{"$f":"-2.975+0.16*H245","v":-2.1749999999999998},1.1910000000000001,1E-3,0.13100000000000001,11.5,{"$f":"N244","v":1}]
[null,null,null,null,null,null,null,6,{"$f":"-2.975+0.16*H246","v":-2.0150000000000001},1.1910000000000001,1E-3,0.13100000000000001,11.5,{"$f":"N245","v":1}]
[null,null,null,"A4","One-way stop",null,null,2,{"$f":"-3.223+0","v":-3.2229999999999999},0.58199999999999996,1E-3,0.89900000000000002,2.16,{"$f":"N239","v":1}]
[null,null,null,null,null,null,null,3,{"$f":"-3.223+0","v":-3.2229999999999999},0.58199999999999996,1E-3,0.89900000000000002,2.16,{"$f":"N240","v":1}]
[null,null,null,null,null,null,null,4,{"$f":"-3.223+0","v":-3.2229999999999999},0.58199999999999996,1E-3,0.89900000000000002,2.16,{"$f":"N241","v":1}]
[null,null,null,null,"Signalized",null,null,2,{"$f":"-1.672+0.16*H250","v":-1.3519999999999999},0.379,1E-3,0.39400000000000002,8.7200000000000006,{"$f":"N242","v":1}]
[null,null,null,null,null,null,null,3,{"$f":"-1.672+0.16*H251","v":-1.1919999999999999},0.379,1E-3,0.39400000000000002,8.7200000000000006,{"$f":"N250","v":1}]
[null,null,null,null,null,null,null,4,{"$f":"-1.672+0.16*H252","v":-1.032},0.379,1E-3,0.39400000000000002,8.7200000000000006,{"$f":"N251","v":1}]
[null,null,null,null,null,null,null,5,{"$f":"-1.672+0.16*H253","v":-0.87199999999999989},0.379,1E-3,0.39400000000000002,8.7200000000000006,{"$f":"N252","v":1}]
[null,null,null,null,null,null,null,6,{"$f":"-1.672+0.16*H254","v":-0.71199999999999997},0.379,1E-3,0.39400000000000002,8.7200000000000006,{"$f":"N253","v":1}]
[null,null,null,"B4","One-way stop",null,null,2,{"$f":"-3.141+0","v":-3.141},0.70899999999999996,1E-3,0.73,0.91800000000000004,{"$f":"N247","v":1}]
[null,null,null,null,null,null,null,3,{"$f":"-3.141+0","v":-3.141},0.70899999999999996,1E-3,0.73,0.91800000000000004,{"$f":"N248","v":1}]
[null,null,null,null,null,null,null,4,{"$f":"-3.141+0","v":-3.141},0.70899999999999996,1E-3,0.73,0.91800000000000004,{"$f":"N249","v":1}]
[null,null,null,null,"Signalized",null,null,2,{"$f":"-2.388+0.16*H258","v":-2.0680000000000001},0.26500000000000001,1E-3,0.90500000000000003,5.37,{"$f":"N250","v":1}]
[null,null,null,null,null,null,null,3,{"$f":"-2.388+0.16*H259","v":-1.9079999999999999},0.26500000000000001,1E-3,0.90500000000000003,5.37,{"$f":"N258","v":1}]
[null,null,null,null,null,null,null,4,{"$f":"-2.388+0.16*H260","v":-1.7479999999999998},0.26500000000000001,1E-3,0.90500000000000003,5.37,{"$f":"N259","v":1}]
[null,null,null,null,null,null,null,5,{"$f":"-2.388+0.16*H261","v":-1.5879999999999999},0.26500000000000001,1E-3,0.90500000000000003,5.37,{"$f":"N260","v":1}]
[null,null,null,null,null,null,null,6,{"$f":"-2.388+0.16*H262","v":-1.4279999999999999},0.26500000000000001,1E-3,0.90500000000000003,5.37,{"$f":"N261","v":1}]
[null,null,null,"A2","One-way stop",null,null,2,{"$f":"-2.687+0","v":-2.6869999999999998},0.26,1E-3,0.94699999999999995,3.4,{"$f":"N255","v":1}]
[null,null,null,null,null,null,null,3,{"$f":"-2.687+0","v":-2.6869999999999998},0.26,1E-3,0.94699999999999995,3.4,{"$f":"N256","v":1}]
[null,null,null,null,null,null,null,4,{"$f":"-2.687+0","v":-2.6869999999999998},0.26,1E-3,0.94699999999999995,3.4,{"$f":"N257","v":1}]
[null,null,null,null,"Signalized",null,null,2,{"$f":"-0.778+0.16*H266","v":-0.45800000000000002},0.32500000000000001,1E-3,0.21199999999999999,2.17,{"$f":"N258","v":1}]
[null,null,null,null,null,null,null,3,{"$f":"-0.778+0.16*H267","v":-0.29800000000000004},0.32500000000000001,1E-3,0.21199999999999999,2.17,{"$f":"N266","v":1}]
[null,null,null,null,null,null,null,4,{"$f":"-0.778+0.16*H268","v":-0.13800000000000001},0.32500000000000001,1E-3,0.21199999999999999,2.17,{"$f":"N267","v":1}]
[null,null,null,null,null,null,null,5,{"$f":"-0.778+0.16*H269","v":2.200000000000002E-2},0.32500000000000001,1E-3,0.21199999999999999,2.17,{"$f":"N268","v":1}]
[null,null,null,null,null,null,null,6,{"$f":"-0.778+0.16*H270","v":0.18199999999999994},0.32500000000000001,1E-3,0.21199999999999999,2.17,{"$f":"N269","v":1}]
[null,null,null,"B2","One-way stop",null,null,2,{"$f":"-2.687+0","v":-2.6869999999999998},0.26,1E-3,0.94699999999999995,3.4,{"$f":"N263","v":1}]
[null,null,null,null,null,null,null,3,{"$f":"-2.687+0","v":-2.6869999999999998},0.26,1E-3,0.94699999999999995,3.4,{"$f":"N264","v":1}]
[null,null,null,null,null,null,null,4,{"$f":"-2.687+0","v":-2.6869999999999998},0.26,1E-3,0.94699999999999995,3.4,{"$f":"N265","v":1}]
[null,null,null,null,"Signalized",null,null,2,{"$f":"-0.778+0.16*H274","v":-0.45800000000000002},0.32500000000000001,1E-3,0.21199999999999999,2.17,{"$f":"N266","v":1}]
[null,null,null,null,null,null,null,3,{"$f":"-0.778+0.16*H275","v":-0.29800000000000004},0.32500000000000001,1E-3,0.21199999999999999,2.17,{"$f":"N274","v":1}]
[null,null,null,null,null,null,null,4,{"$f":"-0.778+0.16*H276","v":-0.13800000000000001},0.32500000000000001,1E-3,0.21199999999999999,2.17,{"$f":"N275","v":1}]
[null,null,null,null,null,null,null,5,{"$f":"-0.778+0.16*H277","v":2.200000000000002E-2},0.32500000000000001,1E-3,0.21199999999999999,2.17,{"$f":"N276","v":1}]
[null,null,null,null,null,null,null,6,{"$f":"-0.778+0.16*H278","v":0.18199999999999994},0.32500000000000001,1E-3,0.21199999999999999,2.17,{"$f":"N277","v":1}]
[null,"Ramp Terminal Property-Damage-Only Crash Freq. Models",null,null,null,null,null,"Model: exp(a + b ln[c AADTin/2 + c AADTout/2] + d ln[c AADTex + c AADTen])"]
[null,"Area Type",null,"Terminal Config.","Control Type",null,"Through Lanes",null,"a","b","c","d","Inverse Disp. (K)","Calib. Factor (C)"]
[]
[null,"Rural",null,"D3ex","One-way stop",null,null,2,{"$f":"-3.164+0.494","v":-2.67},0.59499999999999997,1E-3,0.93700000000000006,6.57,1]
[null,null,null,null,null,null,null,3,{"$f":"-3.164+0.494","v":-2.67},0.59499999999999997,1E-3,0.93700000000000006,6.57,{"$f":"N282","v":1}]
[null,null,null,null,null,null,null,4,{"$f":"-3.164+0.494","v":-2.67},0.59499999999999997,1E-3,0.93700000000000006,6.57,{"$f":"N283","v":1}]
[null,null,null,null,"Signalized",null,null,2,{"$f":"-2.755+0.0879*H285+0.332","v":-2.2471999999999999},0.79700000000000004,1E-3,0.38400000000000001,4.05,1]
[null,null,null,null,null,null,null,3,{"$f":"-2.755+0.0879*H286+0.332","v":-2.1593},0.79700000000000004,1E-3,0.38400000000000001,4.05,{"$f":"N285","v":1}]
[null,null,null,null,null,null,null,4,{"$f":"-2.755+0.0879*H287+0.332","v":-2.0714000000000001},0.79700000000000004,1E-3,0.38400000000000001,4.05,{"$f":"N286","v":1}]
[null,null,null,"D3en","One-way stop",null,null,2,{"$f":"-2.961+0.603","v":-2.3579999999999997},0.88500000000000001,1E-3,0.35,3.9,{"$f":"N282","v":1}]
[null,null,null,null,null,null,null,3,{"$f":"-2.961+0.603","v":-2.3579999999999997},0.88500000000000001,1E-3,0.35,3.9,{"$f":"N283","v":1}]
[null,null,null,null,null,null,null,4,{"$f":"-2.961+0.603","v":-2.3579999999999997},0.88500000000000001,1E-3,0.35,3.9,1]
[null,null,null,null,"Signalized",null,null,2,{"$f":"-3.543+0.0879*H291+0.436","v":-2.9312},0.74099999999999999,1E-3,0.84499999999999997,{"$f":"1/0.269","v":3.7174721189591078},1]
[null,null,null,null,null,null,null,3,{"$f":"-3.543+0.0879*H292+0.436","v":-2.8433000000000002},0.74099999999999999,1E-3,0.84499999999999997,{"$f":"1/0.269","v":3.7174721189591078},1]
[null,null,null,null,null,null,null,4,{"$f":"-3.543+0.0879*H293+0.436","v":-2.7554000000000003},0.74099999999999999,1E-3,0.84499999999999997,{"$f":"1/0.269","v":3.7174721189591078},1]
[null,null,null,"D4","One-way stop",null,null,2,{"$f":"-2.953+0.521","v":-2.4319999999999999},0.84499999999999997,1E-3,0.47599999999999998,4.2699999999999996,{"$f":"N288","v":1}]
[null,null,null,null,null,null,null,3,{"$f":"-2.953+0.521","v":-2.4319999999999999},0.84499999999999997,1E-3,0.47599999999999998,4.2699999999999996,1]
[null,null,null,null,null,null,null,4,{"$f":"-2.953+0.521","v":-2.4319999999999999},0.84499999999999997,1E-3,0.47599999999999998,4.2699999999999996,1]
[null,null,null,null,"Signalized",null,null,2,{"$f":"-3.058+0.0879*H297+0.634","v":-2.2481999999999998},0.879,1E-3,0.54500000000000004,7.21,1]
[null,null,null,null,null,null,null,3,{"$f":"-3.058+0.0879*H298+0.634","v":-2.1602999999999999},0.879,1E-3,0.54500000000000004,7.21,1]
[null,null,null,null,null,null,null,4,{"$f":"-3.058+0.0879*H299+0.634","v":-2.0724},0.879,1E-3,0.54500000000000004,7.21,1]
[null,null,null,"A4","One-way stop",null,null,2,{"$f":"-3.164+0.494","v":-2.67},0.59499999999999997,1E-3,0.93700000000000006,6.57,{"$f":"N294","v":1}]
[null,null,null,null,null,null,null,3,{"$f":"-3.164+0.494","v":-2.67},0.59499999999999997,1E-3,0.93700000000000006,6.57,1]
[null,null,null,null,null,null,null,4,{"$f":"-3.164+0.494","v":-2.67},0.59499999999999997,1E-3,0.93700000000000006,6.57,1]
[null,null,null,null,"Signalized",null,null,2,{"$f":"-2.755+0.0879*H303+0.332","v":-2.2471999999999999},0.79700000000000004,1E-3,0.38400000000000001,4.05,1]
[null,null,null,null,null,null,null,3,{"$f":"-2.755+0.0879*H304+0.332","v":-2.1593},0.79700000000000004,1E-3,0.38400000000000001,4.05,1]
[null,null,null,null,null,null,null,4,{"$f":"-2.755+0.0879*H305+0.332","v":-2.0714000000000001},0.79700000000000004,1E-3,0.38400000000000001,4.05,1]
[null,null,null,"B4","One-way stop",null,null,2,{"$f":"-2.961+0.603","v":-2.3579999999999997},0.88500000000000001,1E-3,0.35,3.9,{"$f":"N300","v":1}]
[null,null,null,null,null,null,null,3,{"$f":"-2.961+0.603","v":-2.3579999999999997},0.88500000000000001,1E-3,0.35,3.9,1]
[null,null,null,null,null,null,null,4,{"$f":"-2.961+0.603","v":-2.3579999999999997},0.88500000000000001,1E-3,0.35,3.9,1]
[null,null,null,null,"Signalized",null,null,2,{"$f":"-3.543+0.0879*H309+0.436","v":-2.9312},0.74099999999999999,1E-3,0.84499999999999997,{"$f":"1/0.269","v":3.7174721189591078},1]
[null,null,null,null,null,null,null,3,{"$f":"-3.543+0.0879*H310+0.436","v":-2.8433000000000002},0.74099999999999999,1E-3,0.84499999999999997,{"$f":"1/0.269","v":3.7174721189591078},1]
[null,null,null,null,null,null,null,4,{"$f":"-3.543+0.0879*H311+0.436","v":-2.7554000000000003},0.74099999999999999,1E-3,0.84499999999999997,{"$f":"1/0.269","v":3.7174721189591078},1]
[null,null,null,"A2","One-way stop",null,null,2,{"$f":"-3.595+0.54","v":-3.0550000000000002},0.77300000000000002,1E-3,0.878,5.49,{"$f":"N306","v":1}]
[null,null,null,null,null,null,null,3,{"$f":"-3.595+0.54","v":-3.0550000000000002},0.77300000000000002,1E-3,0.878,5.49,1]
[null,null,null,null,null,null,null,4,{"$f":"-3.595+0.54","v":-3.0550000000000002},0.77300000000000002,1E-3,0.878,5.49,1]
[null,null,null,null,"Signalized",null,null,2,{"$f":"-2.309+0.0879*H315+0.596","v":-1.5371999999999999},0.59199999999999997,1E-3,0.51600000000000001,4.2699999999999996,1]
[null,null,null,null,null,null,null,3,{"$f":"-2.309+0.0879*H316+0.596","v":-1.4493},0.59199999999999997,1E-3,0.51600000000000001,4.2699999999999996,1]
[null,null,null,null,null,null,null,4,{"$f":"-2.309+0.0879*H317+0.596","v":-1.3614000000000002},0.59199999999999997,1E-3,0.51600000000000001,4.2699999999999996,1]
[null,null,null,"B2","One-way stop",null,null,2,{"$f":"-3.595+0.54","v":-3.0550000000000002},0.77300000000000002,1E-3,0.878,5.49,{"$f":"N312","v":1}]
[null,null,null,null,null,null,null,3,{"$f":"-3.595+0.54","v":-3.0550000000000002},0.77300000000000002,1E-3,0.878,5.49,1]
[null,null,null,null,null,null,null,4,{"$f":"-3.595+0.54","v":-3.0550000000000002},0.77300000000000002,1E-3,0.878,5.49,1]
[null,null,null,null,"Signalized",null,null,2,{"$f":"-2.309+0.0879*H321+0.596","v":-1.5371999999999999},0.59199999999999997,1E-3,0.51600000000000001,4.2699999999999996,1]
[null,null,null,null,null,null,null,3,{"$f":"-2.309+0.0879*H322+0.596","v":-1.4493},0.59199999999999997,1E-3,0.51600000000000001,4.2699999999999996,1]
[null,null,null,null,null,null,null,4,{"$f":"-2.309+0.0879*H323+0.596","v":-1.3614000000000002},0.59199999999999997,1E-3,0.51600000000000001,4.2699999999999996,1]
[null,"Urban",null,"D3ex","One-way stop",null,null,2,{"$f":"-3.164+0.494","v":-2.67},0.59499999999999997,1E-3,0.93700000000000006,6.57,{"$f":"N282","v":1}]
[null,null,null,null,null,null,null,3,{"$f":"-3.164+0.494","v":-2.67},0.59499999999999997,1E-3,0.93700000000000006,6.57,{"$f":"N324","v":1}]
[null,null,null,null,null,null,null,4,{"$f":"-3.164+0.494","v":-2.67},0.59499999999999997,1E-3,0.93700000000000006,6.57,{"$f":"N325","v":1}]
[null,null,null,null,"Signalized",null,null,2,{"$f":"-2.755+0.0879*H327+0.332","v":-2.2471999999999999},0.79700000000000004,1E-3,0.38400000000000001,4.05,{"$f":"N285","v":1}]
[null,null,null,null,null,null,null,3,{"$f":"-2.755+0.0879*H328+0.332","v":-2.1593},0.79700000000000004,1E-3,0.38400000000000001,4.05,{"$f":"N327","v":1}]
[null,null,null,null,null,null,null,4,{"$f":"-2.755+0.0879*H329+0.332","v":-2.0714000000000001},0.79700000000000004,1E-3,0.38400000000000001,4.05,{"$f":"N328","v":1}]
[null,null,null,null,null,null,null,5,{"$f":"-2.755+0.0879*H330+0.332","v":-1.9835},0.79700000000000004,1E-3,0.38400000000000001,4.05,{"$f":"N329","v":1}]
[null,null,null,null,null,null,null,6,{"$f":"-2.755+0.0879*H331+0.332","v":-1.8955999999999997},0.79700000000000004,1E-3,0.38400000000000001,4.05,{"$f":"N330","v":1}]
[null,null,null,"D3en","One-way stop",null,null,2,{"$f":"-2.961+0.603","v":-2.3579999999999997},0.88500000000000001,1E-3,0.35,3.9,{"$f":"N324","v":1}]
[null,null,null,null,null,null,null,3,{"$f":"-2.961+0.603","v":-2.3579999999999997},0.88500000000000001,1E-3,0.35,3.9,{"$f":"N325","v":1}]
[null,null,null,null,null,null,null,4,{"$f":"-2.961+0.603","v":-2.3579999999999997},0.88500000000000001,1E-3,0.35,3.9,{"$f":"N326","v":1}]
[null,null,null,null,"Signalized",null,null,2,{"$f":"-3.543+0.0879*H335+0.436","v":-2.9312},0.74099999999999999,1E-3,0.84499999999999997,{"$f":"1/0.269","v":3.7174721189591078},{"$f":"N327","v":1}]
[null,null,null,null,null,null,null,3,{"$f":"-3.543+0.0879*H336+0.436","v":-2.8433000000000002},0.74099999999999999,1E-3,0.84499999999999997,{"$f":"1/0.269","v":3.7174721189591078},{"$f":"N335","v":1}]
[null,null,null,null,null,null,null,4,{"$f":"-3.543+0.0879*H337+0.436","v":-2.7554000000000003},0.74099999999999999,1E-3,0.84499999999999997,{"$f":"1/0.269","v":3.7174721189591078},{"$f":"N336","v":1}]
[null,null,null,null,null,null,null,5,{"$f":"-3.543+0.0879*H338+0.436","v":-2.6675000000000004},0.74099999999999999,1E-3,0.84499999999999997,{"$f":"1/0.269","v":3.7174721189591078},{"$f":"N337","v":1}]
[null,null,null,null,null,null,null,6,{"$f":"-3.543+0.0879*H339+0.436","v":-2.5796000000000001},0.74099999999999999,1E-3,0.84499999999999997,{"$f":"1/0.269","v":3.7174721189591078},{"$f":"N338","v":1}]
[null,null,null,"D4","One-way stop",null,null,2,{"$f":"-2.953+0.521","v":-2.4319999999999999},0.84499999999999997,1E-3,0.47599999999999998,4.2699999999999996,{"$f":"N332","v":1}]
[null,null,null,null,null,null,null,3,{"$f":"-2.953+0.521","v":-2.4319999999999999},0.84499999999999997,1E-3,0.47599999999999998,4.2699999999999996,{"$f":"N333","v":1}]
[null,null,null,null,null,null,null,4,{"$f":"-2.953+0.521","v":-2.4319999999999999},0.84499999999999997,1E-3,0.47599999999999998,4.2699999999999996,{"$f":"N334","v":1}]
[null,null,null,null,"Signalized",null,null,2,{"$f":"-3.058+0.0879*H343+0.634","v":-2.2481999999999998},0.879,1E-3,0.54500000000000004,7.21,{"$f":"N335","v":1}]
[null,null,null,null,null,null,null,3,{"$f":"-3.058+0.0879*H344+0.634","v":-2.1602999999999999},0.879,1E-3,0.54500000000000004,7.21,{"$f":"N343","v":1}]
[null,null,null,null,null,null,null,4,{"$f":"-3.058+0.0879*H345+0.634","v":-2.0724},0.879,1E-3,0.54500000000000004,7.21,{"$f":"N344","v":1}]
[null,null,null,null,null,null,null,5,{"$f":"-3.058+0.0879*H346+0.634","v":-1.9845000000000002},0.879,1E-3,0.54500000000000004,7.21,{"$f":"N345","v":1}]
[null,null,null,null,null,null,null,6,{"$f":"-3.058+0.0879*H347+0.634","v":-1.8965999999999998},0.879,1E-3,0.54500000000000004,7.21,{"$f":"N346","v":1}]
[null,null,null,"A4","One-way stop",null,null,2,{"$f":"-3.164+0.494","v":-2.67},0.59499999999999997,1E-3,0.93700000000000006,6.57,{"$f":"N340","v":1}]
[null,null,null,null,null,null,null,3,{"$f":"-3.164+0.494","v":-2.67},0.59499999999999997,1E-3,0.93700000000000006,6.57,{"$f":"N341","v":1}]
[null,null,null,null,null,null,null,4,{"$f":"-3.164+0.494","v":-2.67},0.59499999999999997,1E-3,0.93700000000000006,6.57,{"$f":"N342","v":1}]
[null,null,null,null,"Signalized",null,null,2,{"$f":"-2.755+0.0879*H351+0.332","v":-2.2471999999999999},0.79700000000000004,1E-3,0.38400000000000001,4.05,{"$f":"N343","v":1}]
[null,null,null,null,null,null,null,3,{"$f":"-2.755+0.0879*H352+0.332","v":-2.1593},0.79700000000000004,1E-3,0.38400000000000001,4.05,{"$f":"N351","v":1}]
[null,null,null,null,null,null,null,4,{"$f":"-2.755+0.0879*H353+0.332","v":-2.0714000000000001},0.79700000000000004,1E-3,0.38400000000000001,4.05,{"$f":"N352","v":1}]
[null,null,null,null,null,null,null,5,{"$f":"-2.755+0.0879*H354+0.332","v":-1.9835},0.79700000000000004,1E-3,0.38400000000000001,4.05,{"$f":"N353","v":1}]
[null,null,null,null,null,null,null,6,{"$f":"-2.755+0.0879*H355+0.332","v":-1.8955999999999997},0.79700000000000004,1E-3,0.38400000000000001,4.05,{"$f":"N354","v":1}]
[null,null,null,"B4","One-way stop",null,null,2,{"$f":"-2.961+0.603","v":-2.3579999999999997},0.88500000000000001,1E-3,0.35,3.9,{"$f":"N348","v":1}]
[null,null,null,null,null,null,null,3,{"$f":"-2.961+0.603","v":-2.3579999999999997},0.88500000000000001,1E-3,0.35,3.9,{"$f":"N349","v":1}]
[null,null,null,null,null,null,null,4,{"$f":"-2.961+0.603","v":-2.3579999999999997},0.88500000000000001,1E-3,0.35,3.9,{"$f":"N350","v":1}]
[null,null,null,null,"Signalized",null,null,2,{"$f":"-3.543+0.0879*H359+0.436","v":-2.9312},0.74099999999999999,1E-3,0.84499999999999997,{"$f":"1/0.269","v":3.7174721189591078},{"$f":"N351","v":1}]
[null,null,null,null,null,null,null,3,{"$f":"-3.543+0.0879*H360+0.436","v":-2.8433000000000002},0.74099999999999999,1E-3,0.84499999999999997,{"$f":"1/0.269","v":3.7174721189591078},{"$f":"N359","v":1}]
[null,null,null,null,null,null,null,4,{"$f":"-3.543+0.0879*H361+0.436","v":-2.7554000000000003},0.74099999999999999,1E-3,0.84499999999999997,{"$f":"1/0.269","v":3.7174721189591078},{"$f":"N360","v":1}]
[null,null,null,null,null,null,null,5,{"$f":"-3.543+0.0879*H362+0.436","v":-2.6675000000000004},0.74099999999999999,1E-3,0.84499999999999997,{"$f":"1/0.269","v":3.7174721189591078},{"$f":"N361","v":1}]
[null,null,null,null,null,null,null,6,{"$f":"-3.543+0.0879*H363+0.436","v":-2.5796000000000001},0.74099999999999999,1E-3,0.84499999999999997,{"$f":"1/0.269","v":3.7174721189591078},{"$f":"N362","v":1}]
[null,null,null,"A2","One-way stop",null,null,2,{"$f":"-3.595+0.54","v":-3.0550000000000002},0.77300000000000002,1E-3,0.878,5.49,{"$f":"N356","v":1}]
[null,null,null,null,null,null,null,3,{"$f":"-3.595+0.54","v":-3.0550000000000002},0.77300000000000002,1E-3,0.878,5.49,{"$f":"N357","v":1}]
[null,null,null,null,null,null,null,4,{"$f":"-3.595+0.54","v":-3.0550000000000002},0.77300000000000002,1E-3,0.878,5.49,{"$f":"N358","v":1}]
[null,null,null,null,"Signalized",null,null,2,{"$f":"-2.309+0.0879*H367+0.596","v":-1.5371999999999999},0.59199999999999997,1E-3,0.51600000000000001,4.2699999999999996,{"$f":"N359","v":1}]
[null,null,null,null,null,null,null,3,{"$f":"-2.309+0.0879*H368+0.596","v":-1.4493},0.59199999999999997,1E-3,0.51600000000000001,4.2699999999999996,{"$f":"N367","v":1}]
[null,null,null,null,null,null,null,4,{"$f":"-2.309+0.0879*H369+0.596","v":-1.3614000000000002},0.59199999999999997,1E-3,0.51600000000000001,4.2699999999999996,{"$f":"N368","v":1}]
[null,null,null,null,null,null,null,5,{"$f":"-2.309+0.0879*H370+0.596","v":-1.2735000000000003},0.59199999999999997,1E-3,0.51600000000000001,4.2699999999999996,{"$f":"N369","v":1}]
[null,null,null,null,null,null,null,6,{"$f":"-2.309+0.0879*H371+0.596","v":-1.1856},0.59199999999999997,1E-3,0.51600000000000001,4.2699999999999996,{"$f":"N370","v":1}]
[null,null,null,"B2","One-way stop",null,null,2,{"$f":"-3.595+0.54","v":-3.0550000000000002},0.77300000000000002,1E-3,0.878,5.49,{"$f":"N364","v":1}]
[null,null,null,null,null,null,null,3,{"$f":"-3.595+0.54","v":-3.0550000000000002},0.77300000000000002,1E-3,0.878,5.49,{"$f":"N365","v":1}]
[null,null,null,null,null,null,null,4,{"$f":"-3.595+0.54","v":-3.0550000000000002},0.77300000000000002,1E-3,0.878,5.49,{"$f":"N366","v":1}]
[null,null,null,null,"Signalized",null,null,2,{"$f":"-2.309+0.0879*H375+0.596","v":-1.5371999999999999},0.59199999999999997,1E-3,0.51600000000000001,4.2699999999999996,{"$f":"N367","v":1}]
[null,null,null,null,null,null,null,3,{"$f":"-2.309+0.0879*H376+0.596","v":-1.4493},0.59199999999999997,1E-3,0.51600000000000001,4.2699999999999996,{"$f":"N375","v":1}]
[null,null,null,null,null,null,null,4,{"$f":"-2.309+0.0879*H377+0.596","v":-1.3614000000000002},0.59199999999999997,1E-3,0.51600000000000001,4.2699999999999996,{"$f":"N376","v":1}]
[null,null,null,null,null,null,null,5,{"$f":"-2.309+0.0879*H378+0.596","v":-1.2735000000000003},0.59199999999999997,1E-3,0.51600000000000001,4.2699999999999996,{"$f":"N377","v":1}]
[null,null,null,null,null,null,null,6,{"$f":"-2.309+0.0879*H379+0.596","v":-1.1856},0.59199999999999997,1E-3,0.51600000000000001,4.2699999999999996,{"$f":"N378","v":1}]
[null,"Ramp Terminal Crash Severity Model"]
[null,null,"Calibration factor for signal-controlled terminals:",null,null,null,null,1,"Calibration factor for one-way stop-controlled terminals:",null,null,null,null,1]
[null,"Ramp Terminal Crash Distribution"]
[null,"Area Type",null,"Crash Type",null,"Crash Type Category",null,null,"Proportion of Crashes by Severity Level for Specific Models"]
[null,null,null,null,null,null,null,null,"Signalized",null,"One-Way Stop",null,"All-Way Stop"]
[null,null,null,null,null,null,null,null,"FI","PDO","FI","PDO","FI","PDO"]
[null,"Rural",null,"Multiple vehicle",null,"Head-on",null,null,0,6.0000000000000001E-3,0.02,1.4999999999999999E-2,0,0]
[null,null,null,null,null,"Right-angle",null,null,0.33300000000000002,0.187,0.52200000000000002,0.372,0.5,0.375]
[null,null,null,null,null,"Rear-end",null,null,0.55200000000000005,0.46600000000000003,0.27500000000000002,0.27600000000000002,0.5,0.40500000000000003]
[null,null,null,null,null,"Sideswipe",null,null,0,0.219,0.02,0.107,0,9.4E-2]
[null,null,null,null,null,"Other multiple-vehicle crash",null,null,1.4E-2,1.2999999999999999E-2,1.2999999999999999E-2,2.5999999999999999E-2,0,0]
[]
[null,null,null,"Single vehicle",null,"Crash with animal",null,null,0,0,0,0,0,0]
[null,null,null,null,null,"Crash with fixed object",null,null,4.2999999999999997E-2,7.6999999999999999E-2,7.8E-2,0.158,0,6.3E-2]
[null,null,null,null,null,"Crash with other object",null,null,0,0,0,5.0000000000000001E-3,0,0]
[null,null,null,null,null,"Crash with parked vehicle",null,null,0,1.2999999999999999E-2,7.0000000000000001E-3,1.4999999999999999E-2,0,0]
[null,null,null,null,null,"Other single-vehicle crash",null,null,5.8000000000000003E-2,1.9E-2,6.5000000000000002E-2,2.5999999999999999E-2,0,6.3E-2]
[]
[null,null,null,null,null,null,null,"Total:",{"$f":"SUM(I392:I396)+SUM(I386:I390)","v":1},1,1,1,1,1]
[null,"Urban",null,"Multiple vehicle",null,"Head-on",null,null,1.0999999999999999E-2,7.0000000000000001E-3,1.7000000000000001E-2,1.2E-2,0,0]
[null,null,null,null,null,"Right-angle",null,null,0.26,0.22,0.45800000000000002,0.378,0.182,0.33300000000000002]
[null,null,null,null,null,"Rear-end",null,null,0.625,0.54300000000000004,0.373,0.377,0.72699999999999998,0.5]
[null,null,null,null,null,"Sideswipe",null,null,4.2000000000000003E-2,0.14899999999999999,2.5000000000000001E-2,7.9000000000000001E-2,0,0]
[null,null,null,null,null,"Other multiple-vehicle crash",null,null,8.9999999999999993E-3,0.02,1.7000000000000001E-2,1.6E-2,0,0]
[]
[null,null,null,"Single vehicle",null,"Crash with animal",null,null,0,0,0,0,0,0]
[null,null,null,null,null,"Crash with fixed object",null,null,3.3000000000000002E-2,0.05,8.5000000000000006E-2,0.11,0,0.16700000000000001]
[null,null,null,null,null,"Crash with other object",null,null,1E-3,2E-3,0,0,0,0]
[null,null,null,null,null,"Crash with parked vehicle",null,null,1E-3,2E-3,0,8.0000000000000002E-3,0,0]
[null,null,null,null,null,"Other single-vehicle crash",null,null,1.7999999999999999E-2,7.0000000000000001E-3,2.5000000000000001E-2,0.02,9.0999999999999998E-2,0]
[]
[null,null,null,null,null,null,null,"Total:",{"$f":"SUM(I405:I409)+SUM(I399:I403)","v":1},1,1.0000000000000002,1,1,1]

{"sheet":"Temp","index":11,"n_rows":1,"n_cols":16,"rows_kept":1,"cut":false,"hidden":false,"merged":[]}
[0,0,0,0,0,0,0,0,0,0,0,0,0,0,0,0]